program: Gaussian 09
title: 000182350
version: EM64L-G09RevD.01
frameworkgroup: C1[X(C21H28NO3P)]
method: RPBEPBE
basis: SDD
operation: Freq
keyword: #p
keyword: freq=noraman
keyword: PBEPBE/SDD
title: #p freq=noraman PBEPBE/SDD
converged: NO YES NO NO
title: Mulliken charges:
elementType: P O O O N C C C C C C C C C C C C C C C C C C C C C H H H H H H H H H H H H H H H H H H H H H H H H H H H H
charge: 1.242565 -0.501957 -0.493763 -0.648026 -0.279719 -0.685813 0.348417 0.460393 0.150544 0.181473 -0.037695 -0.366158 -0.444668 -0.363385 -0.406918 -0.403706 -0.708432 -0.252357 -0.247174 -0.231851 -0.232674 -0.697713 -0.217726 -0.243367 -0.657940 -0.648832 0.285063 0.218080 0.272624 0.278458 0.192068 0.186808 0.241284 0.240323 0.209994 0.196916 0.249470 0.227887 0.228834 0.225507 0.225270 0.208401 0.205439 0.241903 0.207620 0.243412 0.224281 0.235093 0.206992 0.224883 0.233798 0.210754 0.236369 0.228952
chargesum: 0.00000
title: Mulliken charges with hydrogens summed into heavy atoms:
elementType: P O O O N C C C C C C C C C C C C C C C C C C C C C
charge: 1.242565 -0.501957 -0.493763 -0.648026 0.005344 -0.685813 0.348417 0.460393 0.150544 0.181473 0.180385 -0.093534 -0.166210 0.015491 -0.165635 -0.163383 -0.052051 -0.024470 -0.018340 -0.006345 -0.007404 -0.041971 0.233307 0.216007 0.007733 0.027243
polarizability: 2.95742711e+02 -3.21944851e+01 2.43156239e+02 -6.54244759e+00 2.74155809e+01 2.76003701e+02
1716.lowfreq: -25.1012 -8.3532 -6.8780 -0.0009 -0.0006 -0.0002 8.9930 19.4298 24.9223
frequency: -25.0573 19.1629 24.6058 34.7299 42.3700 50.4343 54.5338 65.1614 73.5936 77.2514 98.9557 114.7067 137.2630 145.5284 163.7329 165.4367 178.8448 187.8776 204.0286 207.2880 215.7618 222.7832 239.0494 248.3331 261.6064 266.3711 297.0796 317.1754 344.8649 364.7619 384.3437 404.0106 409.2090 412.2155 423.0212 463.2225 472.1839 481.4618 509.8871 520.3264 570.6457 585.0996 602.4003 616.4639 619.1018 650.6942 668.3989 698.8159 729.0813 754.9158 761.7619 765.4406 785.0039 798.9912 808.4203 810.3054 818.3727 858.7406 862.0506 871.8678 876.2593 894.5982 900.7979 921.1512 954.2217 957.0228 967.7742 987.2275 989.4208 992.7439 996.6664 1002.2939 1009.7106 1019.7238 1020.1082 1030.4058 1031.6360 1065.5287 1089.4293 1095.7951 1102.6347 1105.0632 1123.5805 1142.4372 1144.0570 1153.5130 1163.6986 1166.6142 1171.7794 1180.1194 1221.6830 1239.8622 1259.9615 1269.5447 1271.5659 1285.7177 1290.5881 1304.5353 1337.4911 1340.5647 1349.4186 1358.1781 1375.4532 1380.5483 1382.9608 1387.9561 1388.3699 1405.8079 1435.7295 1441.6752 1450.1770 1458.2508 1460.5895 1461.2953 1465.6916 1466.3689 1470.1766 1476.1326 1479.0216 1480.2632 1480.5510 1484.7182 1489.2915 1491.1901 1593.8188 1594.7175 1614.4207 1618.9406 2961.9784 2971.1006 2978.4024 2986.1787 2987.2873 2989.8797 3007.1896 3007.2169 3023.9384 3051.8469 3062.1857 3068.8195 3074.2029 3082.6307 3086.7047 3090.9347 3093.0447 3105.2257 3107.1242 3122.8618 3125.1427 3130.8228 3138.5398 3143.1605 3155.7730 3161.3019 3174.0065 3418.2763
redmass: 2.7031 3.1979 3.0187 3.3886 4.2618 3.5992 3.6269 3.3821 3.7655 4.0311 4.3181 2.4089 3.1953 3.6187 2.8831 3.4535 3.3043 4.1328 2.0865 2.0883 1.5735 1.4054 2.0472 1.5295 1.9634 3.6330 3.7456 3.2565 2.9785 3.4607 2.8884 3.9008 4.8029 5.1985 3.0248 2.5791 3.8403 2.8945 5.0780 6.2491 3.2861 2.6003 4.5539 6.7687 4.9381 3.4064 6.5733 4.5919 4.3076 1.5578 1.7775 1.5064 1.8117 1.1194 1.9743 1.2362 1.9339 3.4123 2.9952 2.7620 2.6107 1.7799 2.1431 2.0856 1.4625 1.4643 1.3276 1.3939 1.3460 1.8796 5.6577 5.7237 2.7004 2.5983 2.7391 2.7734 2.1569 3.2694 2.1141 2.1816 2.0194 2.1367 1.9903 1.5403 1.5404 2.0908 1.7421 1.7583 1.1455 1.4925 3.4045 1.9557 1.3065 1.1147 1.1202 1.4334 1.2742 1.9197 1.4022 1.3672 1.2138 1.2261 8.0637 1.2189 1.2206 1.2328 1.2378 3.4797 1.9038 2.7565 1.3141 1.0457 1.2321 1.0475 1.6771 1.0925 1.0495 1.0867 1.0540 1.1948 1.0544 3.1408 1.0793 1.0592 6.7824 7.0814 7.1618 7.1104 1.0608 1.0388 1.0372 1.0437 1.0359 1.0492 1.0657 1.0801 1.0969 1.1079 1.0985 1.0993 1.1015 1.0975 1.0990 1.0988 1.0982 1.1020 1.1035 1.0854 1.0855 1.0896 1.0910 1.0946 1.0966 1.1002 1.0967 1.0741
irintensity: 0.0988 0.5972 0.0744 0.0678 0.2178 0.1472 0.8991 1.0498 0.3302 1.0489 2.3385 0.1656 0.7921 2.3144 1.7020 6.2385 1.9286 6.8619 1.4376 3.2804 4.2608 2.5480 0.1430 4.6485 1.5249 16.0176 3.4059 1.3450 3.7970 9.6848 3.9413 4.8128 0.6333 1.0661 4.2263 23.4441 10.1256 2.3164 0.1195 40.5286 1.7632 31.1078 30.6513 6.3048 115.4483 48.2628 105.8499 5.8988 0.2732 115.7061 29.4947 30.7148 3.9876 4.5029 3.2839 5.5787 3.5231 108.8928 125.7656 40.2816 49.2103 3.2210 2.3683 10.3387 1.4421 6.5855 13.9340 1.8698 1.1164 21.7332 2.6797 50.5197 109.9163 111.9276 104.5402 11.9895 4.8081 18.0815 10.2835 10.1638 9.8018 9.5735 12.3387 1.0525 4.8901 38.0014 29.8791 1.4416 0.1631 5.8282 32.7495 7.2725 1.0015 0.3949 2.4924 2.9556 2.8642 1.0217 3.8442 1.1772 9.2226 9.5926 5.7990 2.9605 19.3397 33.4236 23.4061 0.5026 25.8566 14.9119 28.8322 10.9754 8.5647 10.0815 7.7188 3.4971 9.3189 1.3204 8.2389 18.1733 6.8532 0.8916 11.0277 13.7893 1.6115 0.8695 5.1151 1.5596 23.5411 42.6850 24.3112 30.5829 18.7031 51.4574 23.6314 17.2152 19.4840 8.8462 31.3595 65.4130 11.3046 45.0762 32.8890 28.2268 45.6355 29.1871 32.4279 1.6682 1.3939 4.6556 10.0907 19.7277 36.8669 38.7261 10.8172 3.3034
temp: 298.150 k
press: 1.00000 atm
elementType: 15 8 8 8 7 6 6 6 6 6 6 6 6 6 6 6 6 6 6 6 6 6 6 6 6 6 1 1 1 1 1 1 1 1 1 1 1 1 1 1 1 1 1 1 1 1 1 1 1 1 1 1 1 1
symmnumber: 1
zpe: 1167942.6 jmol-1
zpe.correction: 0.444846 hartree
zpe.thermalcorrener: 0.472099 hartree
zpe.thermalcorrenthalpy: 0.473043 hartree
zpe.thermalcorrgfe: 0.386003 hartree
zpe.sumelectzpe: -1436.736050 hartree
zpe.sumelectthermal: -1436.708797 hartree
zpe.sumelectthermalent: -1436.707853 hartree
zpe.sumelectthermalfe: -1436.794893 hartree
dipole: 0.2748 0.0737 0.8012
dipole: 0.8503
quadrupole: -147.0010 -153.5238 -159.7566
quadrupole: -2.0702 -1.1268 -0.1452
quadrupole: 6.4261 -0.0967 -6.3295 -2.0702 -1.1268 -0.1452
hfenergy: -1437.1808958 hartree
pointgroup: C01 [X(C21H28N1O3P1)]
dipole: 0.0648003 0.0145911 -0.3278545 debye
polarizability: 310.7253995|14.4653366|222.7951756|13.3851777|11.997939|281.3820759 unknown
InChI: InChI=1S/C21H28NO3P/c1-5-16(4)22-21(26(23,24-6-2)25-7-3)19-14-10-8-12-17(19)18-13-9-11-15-20(18)21/h8-16,22H,5-7H2,1-4H3
charge 0 multiplicity 1
54 atoms
P  -0.767735 1.205051 0.857082
O  -2.301687 1.179591 0.030853
O  0.109234 2.525805 0.160249
O  -0.922971 1.271011 2.453694
N  -0.479243 -1.44487 0.878744
C  0.217485 -0.329087 0.222103
C  0.236512 -0.388907 -1.30551
C  1.700177 -0.067951 0.559058
C  1.56178 -0.185472 -1.788886
C  2.466112 0.011073 -0.638826
C  -0.139574 -2.850975 0.519596
C  -0.830967 -0.617842 -2.188301
C  2.300122 0.09042 1.81843
C  -1.359117 -3.757141 0.835936
C  1.823708 -0.204973 -3.174781
C  3.857669 0.234012 -0.578475
C  1.136404 -3.384411 1.222544
C  -0.56481 -0.643965 -3.579462
C  3.698891 0.312525 1.878409
C  0.750066 -0.436739 -4.067058
C  4.468602 0.38216 0.690011
C  -2.593605 -3.455127 -0.035426
C  -3.542431 1.436902 0.822304
C  0.100085 3.836456 0.871191
C  -4.546534 0.322186 0.532743
C  -1.131558 4.670032 0.501629
H  -0.571513 -1.301221 1.895506
H  0.025884 -2.866319 -0.57467
H  -1.84399 -0.755374 -1.800213
H  1.699526 0.053088 2.734308
H  -1.050339 -4.812994 0.701549
H  -1.616602 -3.642348 1.910216
H  2.837357 -0.046344 -3.55925
H  4.460183 0.29573 -1.491833
H  1.358058 -4.416045 0.890088
H  0.996698 -3.406504 2.321304
H  2.014739 -2.755063 1.001864
H  -1.3832 -0.817672 -4.286917
H  4.189657 0.437414 2.850056
H  0.935288 -0.456391 -5.147096
H  5.548755 0.555419 0.75559
H  -3.458559 -4.076365 0.261483
H  -2.381905 -3.654975 -1.10313
H  -2.871099 -2.391385 0.060603
H  -3.92387 2.41994 0.487956
H  -3.285309 1.489139 1.897569
H  1.031862 4.315771 0.528059
H  0.159791 3.654062 1.960997
H  -5.502128 0.536414 1.048363
H  -4.746848 0.24684 -0.550159
H  -4.166738 -0.650125 0.889391
H  -1.044456 5.684164 0.935314
H  -1.219254 4.76256 -0.594262
H  -2.058406 4.211323 0.889159
