program: Gaussian 09
title: 000017874
version: EM64L-G09RevD.01
frameworkgroup: C1[X(C25H16)]
method: RPBEPBE
basis: SDD
operation: Freq
keyword: #p
keyword: freq=noraman
keyword: PBEPBE/SDD
title: #p freq=noraman PBEPBE/SDD
converged: NO NO NO NO
title: Mulliken charges:
elementType: C C C C C C C C C C C C C C C C C C C C C C C C C H H H H H H H H H H H H H H H H
charge: -0.069842 -0.112801 0.380247 0.297623 0.315392 0.060773 0.298994 0.474209 0.198172 -0.885914 0.572403 -0.449875 -0.514049 -0.530486 -0.407709 -0.389465 -0.474908 0.480531 -0.283348 -0.361010 -0.480979 -0.495835 -0.258410 -0.254683 -0.825780 0.233173 0.223234 0.236234 0.231388 0.231305 0.230525 0.243693 0.229648 0.224092 0.235406 0.249279 0.227757 0.230425 0.236922 0.228506 0.225157
chargesum: 0.00000
title: Mulliken charges with hydrogens summed into heavy atoms:
elementType: C C C C C C C C C C C C C C C C C C C C C C C C C
charge: -0.069842 -0.112801 0.380247 0.297623 0.315392 0.060773 0.298994 0.474209 0.198172 -0.652741 0.572403 -0.226641 -0.277814 -0.299097 -0.176403 -0.158939 -0.231215 0.480531 -0.053700 -0.136918 -0.245573 -0.246557 -0.030653 -0.024258 -0.135194
chargesum: -0.00001
polarizability: 4.48754183e+02 3.03104266e+01 3.83283279e+02 1.59974983e-01 -4.15390797e-01 1.03330663e+02
1716.lowfreq: -63.6985 -8.6211 -0.2313 -0.0009 -0.0008 7.9028 9.7167 42.5995 62.5815
frequency: -63.6756 42.5474 62.5758 75.5416 106.9419 148.6759 165.8149 190.3991 212.8973 233.1775 275.0125 293.1326 318.4492 322.4035 331.8222 348.0786 407.5018 434.3771 435.1395 453.3892 466.6430 499.5987 518.6844 540.2982 549.3086 564.4556 569.1963 582.6701 596.4935 598.3711 610.0239 665.7110 669.3386 691.6085 722.0801 740.7182 755.7154 768.8585 782.8404 794.9035 796.4969 829.3091 853.7914 859.0006 873.3263 883.5316 884.6618 904.7065 911.1334 926.3423 960.8072 963.2992 965.9865 974.8353 985.4963 989.8810 1005.0396 1021.1538 1030.4544 1038.5654 1049.2214 1074.0256 1082.2036 1104.4731 1137.6447 1166.6154 1173.8443 1181.3225 1210.2538 1223.0052 1230.8174 1240.8260 1272.1456 1273.2124 1296.2104 1318.0786 1321.6540 1332.6278 1376.2272 1384.0229 1392.8944 1397.0275 1404.5691 1420.4810 1425.8119 1436.9757 1438.8292 1453.3410 1472.9788 1475.9745 1478.0952 1495.6305 1516.8754 1527.4299 1570.8475 1578.2437 1596.8806 1601.2483 1622.2154 1624.3316 1627.7066 2976.3086 3056.4817 3084.6370 3122.5705 3126.3537 3127.9165 3130.0549 3134.7321 3140.1029 3145.0718 3150.7207 3153.7468 3159.2377 3163.4885 3169.6882 3170.6710
redmass: 1.0144 4.3020 4.4243 4.1187 3.9550 4.1902 4.3439 3.9485 3.9913 4.3276 3.7464 5.1632 4.5443 6.1086 3.7847 5.3525 4.7696 3.1622 3.6412 4.9427 3.2646 5.1220 3.0467 6.5520 6.5357 3.3729 3.0551 7.2239 3.6446 5.4307 6.1320 6.4988 3.3883 6.3075 2.4726 5.7881 1.5521 1.9940 1.4011 1.9439 6.0436 1.4830 5.3719 1.5060 1.9247 1.7404 4.8915 5.7907 1.4889 2.1239 1.4331 2.8987 1.4193 1.3892 1.3961 1.3601 2.1765 3.4999 5.6548 2.2644 1.6539 3.0340 2.8478 2.1006 1.6721 1.2413 1.2126 1.2754 1.4392 2.0582 1.4750 1.8277 1.9042 1.8217 2.3952 2.9248 2.2641 2.4840 2.8024 4.7155 3.9242 1.2876 5.7387 4.0291 3.0065 3.6067 3.2622 2.3428 1.1010 1.8594 1.7503 3.3309 4.3385 3.7684 5.3651 7.5567 5.8285 6.0745 5.8779 7.2030 6.6054 1.0383 1.0959 1.0992 1.0862 1.0869 1.0885 1.0876 1.0888 1.0911 1.0921 1.0945 1.0881 1.0971 1.0987 1.0938 1.0946
irintensity: 0.4493 0.0356 0.4269 1.2897 1.1310 0.2496 0.2889 0.0920 1.4727 0.5852 2.2339 0.1406 0.0059 0.2644 2.9521 0.0584 0.0335 0.3074 5.3913 0.2662 6.2654 2.8346 3.8284 2.6660 1.5172 0.2255 1.5539 1.3473 2.8846 5.2871 1.6529 1.0370 10.2464 1.7153 1.9299 1.3301 19.8938 81.3861 4.1632 4.1431 2.4287 80.5613 0.5878 27.4656 3.6818 0.5624 0.3354 2.2512 7.7437 20.1860 5.4914 3.1820 0.5768 0.3730 2.1069 0.9367 0.2138 1.9700 7.3742 7.9625 14.1201 1.3454 4.1114 1.6741 1.0253 4.0344 2.7497 0.0969 6.8067 1.7463 7.5177 0.8926 1.1359 12.3659 3.6143 12.1063 2.6270 1.4276 5.1630 1.1903 0.9285 9.7637 0.8592 7.7546 1.3216 5.9160 6.1245 8.1766 12.2526 1.3772 22.9394 10.9021 21.7454 3.7960 0.0520 2.5505 1.9293 4.9195 14.0977 0.4301 10.2790 44.0308 20.9755 17.5498 2.1598 2.0384 17.1999 6.5956 10.9310 6.7558 21.3434 11.5289 17.4599 10.3214 26.4778 74.3358 26.6263
temp: 298.150 k
press: 1.00000 atm
elementType: 6 6 6 6 6 6 6 6 6 6 6 6 6 6 6 6 6 6 6 6 6 6 6 6 6 1 1 1 1 1 1 1 1 1 1 1 1 1 1 1 1
symmnumber: 1
zpe: 850675.4 jmol-1
zpe.correction: 0.324005 hartree
zpe.thermalcorrener: 0.340837 hartree
zpe.thermalcorrenthalpy: 0.341781 hartree
zpe.thermalcorrgfe: 0.280096 hartree
zpe.sumelectzpe: -960.706226 hartree
zpe.sumelectthermal: -960.689394 hartree
zpe.sumelectthermalent: -960.688450 hartree
zpe.sumelectthermalfe: -960.750135 hartree
dipole: 0.3652 -0.6082 0.0527
dipole: 0.7114
quadrupole: -120.7609 -120.1971 -154.3680
quadrupole: -2.1870 0.1623 -0.1830
quadrupole: 11.0144 11.5783 -22.5927 -2.1870 0.1623 -0.1830
hfenergy: -961.0302308 hartree
pointgroup: C01 [X(C25H16)]
dipole: 0.1286836 -0.247681 0.0204999 debye
polarizability: 452.2271614|26.0625847|379.8106903|0.324412|-0.0900671|103.3302734 unknown
InChI: InChI=1S/C25H16/c1-15-9-11-19-20-8-4-6-16-10-12-21-18-7-3-2-5-17(18)14-23(22(19)13-15)25(21)24(16)20/h2-14H,1H3
charge 0 multiplicity 1
41 atoms
C  -0.424735 0.59078 -0.001003
C  0.612939 1.601979 0.001201
C  -0.058348 -0.818397 -0.002413
C  -1.809431 0.979719 -0.000891
C  2.008245 1.240083 0.000559
C  1.371003 -1.198619 -0.003061
C  2.385022 -0.185612 -0.003775
C  0.245364 2.997939 0.004733
C  -2.853976 -0.03107 -0.002969
C  -1.083601 -1.774011 -0.003258
C  -2.46776 -1.421415 -0.003907
C  -2.133661 2.385523 0.001926
C  -1.148329 3.356126 0.004825
C  1.771001 -2.567798 -0.007023
C  2.976184 2.273705 0.005269
C  3.750294 -0.596197 -0.010975
C  1.253832 4.003761 0.00843
C  3.120074 -2.966531 -0.008745
C  2.607804 3.64061 0.009153
C  -4.25454 0.275635 -0.004232
C  4.114883 -1.949013 -0.015051
C  -3.47626 -2.442948 -0.005619
C  -5.220581 -0.735416 -0.006018
C  -4.83115 -2.111221 -0.006601
C  3.506193 -4.434881 0.013275
H  -0.848455 -2.842219 -0.003547
H  -3.18108 2.697849 0.002253
H  -1.415531 4.418976 0.007438
H  1.010423 -3.354097 -0.008584
H  4.042006 2.030809 0.006779
H  4.546141 0.153044 -0.017576
H  0.957959 5.0590 0.011138
H  3.387168 4.409759 0.012792
H  -4.590618 1.316565 -0.004057
H  5.174799 -2.228608 -0.023133
H  -3.161823 -3.493206 -0.006252
H  -6.284514 -0.474545 -0.007095
H  -5.597344 -2.893768 -0.007897
H  3.39283 -4.862625 1.028229
H  2.871981 -5.033305 -0.665324
H  4.557093 -4.581259 -0.290093
