program: Gaussian 09
title: 000182348
version: EM64L-G09RevD.01
frameworkgroup: C1[X(C10H19NO3)]
method: RPBEPBE
basis: SDD
operation: Freq
keyword: #p
keyword: freq=noraman
keyword: PBEPBE/SDD
title: #p freq=noraman PBEPBE/SDD
converged: YES YES NO NO
title: Mulliken charges:
elementType: O O O N C C C C C C C C C C H H H H H H H H H H H H H H H H H H H
charge: -0.246083 -0.253463 -0.194662 -0.111238 -0.366498 -0.328216 -0.335358 -0.317292 -0.670822 -0.669029 0.280260 -0.581630 0.222808 -0.755904 0.233422 0.222299 0.207572 0.193001 0.224142 0.193292 0.244413 0.234575 0.210021 0.227114 0.209427 0.207260 0.225112 0.209816 0.278579 0.239767 0.251278 0.233082 0.282955
chargesum: 0.00000
title: Mulliken charges with hydrogens summed into heavy atoms:
elementType: O O O N C C C C C C C C C C
charge: -0.246083 -0.253463 -0.194662 -0.111238 0.089223 0.072357 0.082076 0.161696 -0.024260 -0.026841 0.280260 -0.063284 0.222808 0.011410
polarizability: 1.54944530e+02 1.31089952e+00 1.26100389e+02 -5.02047373e+00 4.67693311e-01 1.05294431e+02
1716.lowfreq: -4.3558 -1.8820 -0.0007 0.0001 0.0007 10.2921 18.2479 27.1149 30.2969
frequency: 18.1893 26.5279 30.2086 46.3889 59.0265 73.4146 86.9215 89.2243 144.8536 165.4548 176.3435 208.1714 240.1371 260.8290 276.0574 301.3873 318.4928 358.7118 390.3628 422.1250 454.7094 473.7732 498.8663 520.5055 600.1318 690.2577 745.4201 781.3437 792.5509 797.2531 801.2776 826.7624 886.6365 914.2514 939.0242 989.5063 1010.9346 1030.1511 1055.1526 1067.6358 1076.6520 1079.9600 1085.6260 1100.2309 1125.5938 1177.7826 1184.2246 1209.0626 1222.8543 1248.8110 1279.3941 1284.3290 1292.1920 1298.7843 1327.7920 1363.4347 1370.0061 1374.0241 1382.3788 1388.6239 1389.8377 1431.4560 1445.6248 1447.1421 1453.4520 1463.0513 1464.3527 1472.4054 1480.6881 1485.0082 1488.1215 1491.8966 1617.5995 1647.9699 2861.4187 2870.4885 2917.8629 2979.8401 2982.1626 2983.2525 3014.2075 3026.5983 3037.0110 3041.1399 3057.1766 3063.6623 3074.8876 3076.6140 3090.4589 3091.3930 3125.3985 3127.7550 3132.9897
redmass: 4.1673 4.1432 5.0538 4.5945 3.0961 3.7294 2.5398 2.1261 1.0562 1.5827 3.6468 1.3772 2.0474 2.5147 1.9841 2.4657 3.3895 2.7496 2.6821 2.7071 2.6547 3.7294 3.0632 3.4777 4.3057 3.7916 2.8089 1.6515 1.6017 1.2196 1.7134 2.4510 1.8892 2.0254 4.6076 2.2117 1.9888 1.8682 3.0308 1.8463 2.4064 2.2432 2.0412 2.0553 1.7288 1.8467 2.0489 2.2649 2.0884 1.4445 1.2067 1.4439 1.1939 1.2078 1.3294 1.3285 1.3243 1.2682 1.3381 1.2578 1.2357 1.0880 1.0930 1.0592 1.0712 1.0515 1.0560 1.0526 1.0501 1.0712 1.0722 1.0788 8.7237 7.8259 1.0720 1.0713 1.0698 1.0378 1.0358 1.0357 1.0630 1.0883 1.0877 1.0616 1.0887 1.0947 1.0983 1.0981 1.1004 1.1004 1.0991 1.1006 1.1078
irintensity: 2.2064 0.4152 1.0559 3.8812 1.4327 1.1130 2.4787 0.2091 0.3538 4.2490 1.3163 0.2222 2.8504 8.8782 2.1129 4.8469 5.8925 0.9264 9.6800 2.0506 14.6174 6.4463 14.7932 6.8705 11.5279 6.4886 5.0650 6.1366 15.6957 7.4367 1.6914 3.5220 11.6019 1.5475 63.3202 3.1486 14.8981 6.1522 10.2941 36.9737 17.2710 82.9522 3.8345 201.9348 5.0265 150.8713 132.4327 26.9274 69.0702 24.8648 40.8590 71.9671 22.4450 13.9325 11.1865 7.8811 5.4211 81.6005 5.0189 18.8188 20.8746 17.7083 24.1024 20.8551 26.2996 6.5491 1.5213 1.9903 2.9192 17.0125 11.0804 10.5829 211.0422 94.9223 40.4276 143.9843 66.9297 6.9741 31.9612 28.0240 3.4425 9.8389 15.2848 22.8356 18.4766 5.1935 35.4938 79.3617 34.6350 46.7335 5.9407 4.6569 13.2041
temp: 298.150 k
press: 1.00000 atm
elementType: 8 8 8 7 6 6 6 6 6 6 6 6 6 6 1 1 1 1 1 1 1 1 1 1 1 1 1 1 1 1 1 1 1
symmnumber: 1
zpe: 734349.5 jmol-1
zpe.correction: 0.279699 hartree
zpe.thermalcorrener: 0.297178 hartree
zpe.thermalcorrenthalpy: 0.298122 hartree
zpe.thermalcorrgfe: 0.231025 hartree
zpe.sumelectzpe: -671.727490 hartree
zpe.sumelectthermal: -671.710012 hartree
zpe.sumelectthermalent: -671.709068 hartree
zpe.sumelectthermalfe: -671.776164 hartree
dipole: -1.3733 1.2215 0.8971
dipole: 2.0452
quadrupole: -80.9322 -91.4293 -86.0277
quadrupole: 9.2742 9.2230 -3.3238
quadrupole: 5.1975 -5.2996 0.1020 9.2742 9.2230 -3.3238
hfenergy: -672.0071893 hartree
pointgroup: C01 [X(C10H19N1O3)]
dipole: -0.4513963 0.4691994 0.4727934 debye
polarizability: 154.2083553|-1.2776026|125.0530686|-7.4649481|5.0711385|107.0779267 unknown
InChI: InChI=1S/C10H19NO3/c1-4-11(5-2)6-7-14-10(13)8-9(3)12/h4-8H2,1-3H3
charge 0 multiplicity 1
33 atoms
O  0.648346 -1.386609 0.944337
O  1.555364 0.72275 0.52038
O  3.64094 -1.992215 -1.769656
N  -2.722679 0.001783 -0.084163
C  -1.418145 -0.675729 -0.263395
C  -3.828713 -0.593627 -0.878595
C  -2.623213 1.483283 -0.20352
C  -0.710071 -0.770731 1.101356
C  -4.299976 -1.950971 -0.323267
C  -3.703324 2.227069 0.604421
C  1.690583 -0.520036 0.63861
C  2.99544 -1.292367 0.472066
C  3.627577 -1.063838 -0.923592
C  4.221891 0.307766 -1.1825
H  -0.759206 -0.143077 -0.986826
H  -1.57453 -1.695297 -0.656518
H  -4.678111 0.112384 -0.847498
H  -3.546181 -0.702137 -1.956134
H  -1.627338 1.784393 0.172133
H  -2.662862 1.803639 -1.274922
H  -1.244439 -1.452072 1.77921
H  -0.599267 0.225959 1.561947
H  -3.49233 -2.705688 -0.338564
H  -4.639824 -1.836473 0.720758
H  -5.136558 -2.346767 -0.928758
H  -4.722991 1.986512 0.252625
H  -3.638068 1.95034 1.671182
H  -3.567806 3.320838 0.511924
H  2.813896 -2.366963 0.616667
H  3.699277 -0.922003 1.241603
H  4.498719 0.41404 -2.242297
H  5.126358 0.442821 -0.557245
H  3.50604 1.094022 -0.880766
