program: Gaussian 09
title: 000191794
version: EM64L-G09RevD.01
frameworkgroup: C1[X(C20H26BrNO3)]
method: RPBEPBE
basis: SDD
operation: Freq
keyword: #p
keyword: freq=noraman
keyword: PBEPBE/SDD
title: #p freq=noraman PBEPBE/SDD
converged: YES YES NO NO
title: Mulliken charges:
elementType: Br O O O N C C C C C C C C C C C C C C C C C C C C H H H H H H H H H H H H H H H H H H H H H H H H H H
charge: -0.036570 -0.279144 -0.280317 -0.245212 -0.433245 -0.162382 -0.135605 0.364077 -0.228797 -0.492621 -0.471321 -0.592741 -0.483158 0.324018 -0.314462 -0.777083 -0.573999 0.169047 -0.433786 0.196332 -0.392218 0.139149 0.235341 -0.529697 -0.753367 0.280267 0.222487 0.225654 0.236476 0.208052 0.214331 0.201262 0.230232 0.225732 0.216538 0.209075 0.199117 0.212671 0.216068 0.227208 0.234853 0.289635 0.226962 0.221785 0.243086 0.332870 0.247319 0.224193 0.226395 0.305616 0.309879
chargesum: 0.00000
title: Mulliken charges with hydrogens summed into heavy atoms:
elementType: Br O O O N C C C C C C C C C C C C C C C C C C C C
charge: -0.036570 -0.279144 -0.280317 -0.245212 -0.100375 0.117884 0.086882 0.364077 -0.003143 -0.048092 -0.055729 -0.136777 -0.057545 0.324018 0.097326 -0.098955 -0.057402 0.169047 -0.212001 0.196332 -0.149131 0.139149 0.235341 0.168210 -0.137872
polarizability: 2.98411955e+02 4.71522810e+00 2.37167371e+02 2.29257645e+01 -1.54711225e+01 2.00952106e+02
1716.lowfreq: -11.8768 -11.6540 -4.1947 -0.0009 -0.0003 0.0003 12.9188 25.4077 29.2290
frequency: 11.3451 24.7796 28.9748 62.4716 70.8063 73.7417 84.8068 95.3426 105.1504 122.4267 131.7138 147.4278 167.5675 185.9031 203.5364 225.1769 238.5670 261.9500 280.9843 293.8639 309.6146 324.2826 334.3527 344.2117 349.7831 372.2385 395.5587 435.4519 448.0085 454.1090 472.7536 496.9660 506.1927 532.5353 551.9406 555.9122 578.0479 600.9296 630.9930 637.4741 642.7752 664.9410 683.3542 713.6872 734.4274 756.6004 764.5664 808.4553 826.4596 831.8077 845.4506 862.7111 865.8581 869.0579 883.6883 885.4821 917.0237 934.6990 944.8325 951.1332 952.8199 969.5965 974.0244 995.0010 1013.6971 1026.4574 1064.2039 1076.0288 1088.1881 1098.7303 1105.4362 1114.3551 1118.6602 1132.2774 1142.8850 1147.3911 1149.8573 1167.4231 1176.0096 1182.7105 1194.8052 1200.4364 1217.8082 1226.6803 1236.0119 1239.5732 1248.3237 1257.4769 1266.1240 1276.7847 1287.7016 1291.9277 1297.4957 1310.9826 1327.0836 1329.9897 1335.3662 1350.5954 1352.6833 1362.2463 1373.2463 1379.4121 1383.8962 1412.3241 1431.9187 1436.1698 1458.0151 1459.5821 1466.0710 1468.0062 1470.4679 1472.9638 1476.6772 1478.6721 1484.2581 1491.7226 1496.6111 1521.9074 1581.0627 1606.7884 1614.1938 2940.3651 2957.1243 2961.9519 2966.0274 2974.5808 2983.3478 2985.4829 2987.4507 2993.2641 3001.9023 3005.8085 3034.6911 3046.4349 3046.9626 3048.9600 3056.4920 3057.6268 3066.3230 3073.0293 3076.9138 3086.8138 3128.9452 3146.9952 3149.6002 3169.8329 3440.2244
redmass: 8.8580 5.0185 4.5998 4.0915 3.9428 3.8299 4.6993 2.8637 5.8747 2.2752 1.8565 1.7727 3.4051 3.1570 3.4219 1.2619 2.3258 2.7882 3.5519 3.7528 8.1622 2.9495 4.4834 3.9499 3.5222 2.9651 2.9324 5.3006 3.1628 3.2955 3.5359 3.3841 3.6303 3.5590 3.6568 3.0287 3.9001 3.2730 3.3718 4.5723 4.0180 3.6441 1.6000 3.7078 3.4057 2.4285 4.1305 1.6831 1.9352 2.6552 1.4281 3.0132 3.0573 1.7524 3.3680 3.4952 2.0439 1.4274 3.4077 2.6523 2.4545 2.9710 1.9995 2.3393 2.6726 1.8092 2.8556 1.9730 2.6256 2.2727 1.6871 1.2593 1.7533 1.9710 1.1287 1.2739 1.4389 1.4450 1.2975 1.4861 2.4782 1.4162 1.6106 1.3432 1.4935 1.7577 2.5823 1.5968 1.8777 1.5114 1.8810 1.6920 1.6194 1.4066 1.3466 1.3361 1.6280 1.4251 1.5541 2.2552 2.2141 1.2495 1.5262 1.1106 1.2905 3.4074 1.4491 1.1790 1.0513 1.1152 1.0757 1.1472 1.1051 1.2423 1.0867 1.0908 1.1001 1.9734 7.1515 5.5553 7.6664 1.0815 1.0704 1.0767 1.0325 1.0746 1.0441 1.0552 1.0717 1.0596 1.0656 1.0628 1.0988 1.0960 1.1036 1.0931 1.1043 1.1026 1.0568 1.1035 1.0988 1.0992 1.1001 1.0861 1.1086 1.0952 1.0755
irintensity: 0.1525 0.1421 1.1370 4.8937 0.6350 1.0965 10.1581 1.5594 5.3936 2.4514 4.4911 0.5496 1.0608 4.7437 1.6956 0.2105 1.2677 1.4490 1.0209 4.5839 2.0824 2.1999 0.4045 0.1522 0.7042 3.0187 2.1380 23.5109 1.9500 5.3773 13.7691 0.6686 1.6040 1.6058 1.6463 2.3398 10.4355 20.7004 28.3098 48.5986 40.4927 1.6244 55.5449 9.3406 8.6148 2.8362 0.5625 43.2105 2.9273 2.5378 8.2839 7.7640 2.2649 14.1732 3.6318 11.8404 11.4957 0.8424 3.2228 17.7774 15.2396 10.5453 8.2380 5.2696 31.9413 9.3118 47.2379 15.2547 3.2263 33.1816 4.5897 0.1029 15.0277 12.0757 0.4489 6.6730 2.6510 12.6866 2.6532 1.7614 18.7480 9.5937 6.3666 44.5724 7.7062 6.2395 44.8997 30.3167 30.7236 24.8827 22.5719 4.3885 12.3177 3.3014 1.5370 3.7780 17.1438 0.7176 5.2872 11.1751 3.2217 30.4037 15.3725 42.4103 11.2208 45.0490 49.1087 20.7124 13.4331 28.1132 24.4435 26.9485 5.6836 1.8188 3.7036 14.7431 36.6194 358.5948 45.1028 103.7320 75.5638 19.7070 15.2192 2.0232 69.0516 21.3886 17.5434 59.7660 74.2168 30.6169 68.4440 58.4713 43.2610 38.6276 12.3915 6.5574 40.8307 54.0758 2.7617 72.2758 31.8904 22.5653 19.2829 7.8979 0.0508 17.0096 78.2393
temp: 298.150 k
press: 1.00000 atm
elementType: 35 8 8 8 7 6 6 6 6 6 6 6 6 6 6 6 6 6 6 6 6 6 6 6 6 1 1 1 1 1 1 1 1 1 1 1 1 1 1 1 1 1 1 1 1 1 1 1 1 1 1
symmnumber: 1
zpe: 1113674.7 jmol-1
zpe.correction: 0.424176 hartree
zpe.thermalcorrener: 0.448153 hartree
zpe.thermalcorrenthalpy: 0.449097 hartree
zpe.thermalcorrgfe: 0.368504 hartree
zpe.sumelectzpe: -1069.725505 hartree
zpe.sumelectthermal: -1069.701529 hartree
zpe.sumelectthermalent: -1069.700585 hartree
zpe.sumelectthermalfe: -1069.781177 hartree
dipole: 0.2699 1.8934 -0.2845
dipole: 1.9336
quadrupole: -160.7217 -137.3330 -170.9970
quadrupole: -7.4187 14.3683 -5.0685
quadrupole: -4.3712 19.0176 -14.6465 -7.4187 14.3683 -5.0685
hfenergy: -1070.1496816 hartree
pointgroup: C01 [X(C20H26Br1N1O3)]
dipole: -0.0349669 0.7367638 -0.1862161 debye
polarizability: 289.4864073|20.1094124|239.3408053|30.8661794|-12.5000438|207.704219 unknown
InChI: InChI=1S/C20H26BrNO3/c1-20-9-7-13-12-5-6-17(24-2)19(22-18(23)11-21)15(12)4-3-14(13)16(20)8-10-25-20/h5-6,13-14,16,22H,3-4,7-11H2,1-2H3
charge 0 multiplicity 1
51 atoms
Br -5.105963 -2.757077 -1.151562
O  4.056714 -0.588003 -1.88073
O  -3.533365 1.327531 -1.180108
O  -2.997777 -1.483743 2.286363
N  -2.792336 -0.887899 0.013241
C  2.683254 -0.756113 0.026993
C  2.254181 -0.268176 1.423895
C  3.821823 0.106217 -0.578409
C  1.716986 1.19591 1.277456
C  3.290543 1.531957 -0.793992
C  2.779436 2.093226 0.564753
C  3.19035 -2.195044 -0.217547
C  1.18015 -1.146698 2.093079
C  0.314371 1.229141 0.627706
C  3.899276 -2.051774 -1.603899
C  5.155886 0.098518 0.206045
C  -0.111317 -1.238819 1.256454
C  -0.55896 0.093324 0.667484
C  -0.144738 2.413891 0.00693
C  -1.847731 0.196353 0.075845
C  -1.409606 2.509914 -0.608081
C  -2.260928 1.390207 -0.583383
C  -3.332815 -1.586819 1.064261
C  -4.011626 2.522189 -1.880282
C  -4.432158 -2.614327 0.769421
H  1.823942 -0.608292 -0.659753
H  3.142244 -0.240253 2.088603
H  1.600769 1.598271 2.307907
H  2.469491 1.497576 -1.534532
H  4.079005 2.193511 -1.200291
H  3.638337 2.200193 1.255556
H  2.395999 3.118596 0.417909
H  2.37172 -2.934157 -0.251995
H  3.900265 -2.512776 0.56865
H  0.940219 -0.717267 3.086365
H  1.571875 -2.166044 2.273127
H  4.896101 -2.533635 -1.614502
H  3.29407 -2.462502 -2.431438
H  5.085039 0.608563 1.183018
H  5.515263 -0.929331 0.388311
H  5.919575 0.618559 -0.398678
H  -0.914786 -1.64983 1.890405
H  0.026315 -1.956456 0.420242
H  0.501073 3.296317 -0.019529
H  -1.712847 3.443985 -1.088904
H  -3.306291 -0.958422 -0.874642
H  -5.003526 2.249079 -2.268572
H  -3.340473 2.791532 -2.718436
H  -4.104227 3.378321 -1.185154
H  -4.070226 -3.622417 1.022959
H  -5.320181 -2.371305 1.370939
