program: Gaussian 09
title: 000191821
version: EM64L-G09RevD.01
frameworkgroup: C1[X(C9H14FN2O14P3)]
method: RPBEPBE
basis: SDD
operation: Freq
keyword: #p
keyword: freq=noraman
keyword: PBEPBE/SDD
title: #p freq=noraman PBEPBE/SDD
converged: NO YES NO NO
title: Mulliken charges:
elementType: P P P F O O O O O O O O O O O O O O N N C C C C C C C C C H H H H H H H H H H H H H H
charge: 1.449669 1.466332 1.437712 -0.190621 -0.257854 -0.410799 -0.496414 -0.331957 -0.749809 -0.631901 -0.633706 -0.211708 -0.731665 -0.747026 -0.515706 -0.649257 -0.679169 -0.617131 -0.176786 -0.399462 -0.119567 -0.007980 -0.095329 -0.061429 -0.445359 0.323441 -0.067672 -0.280513 0.157986 0.203486 0.310582 0.241894 0.310438 0.347998 0.244127 0.371397 0.247742 0.377751 0.267587 0.418055 0.452667 0.432189 0.447767
chargesum: 0.00000
title: Mulliken charges with hydrogens summed into heavy atoms:
elementType: P P P F O O O O O O O O O O O O O O N N C C C C C C C C C
charge: 1.449669 1.466332 1.437712 -0.190621 -0.257854 -0.039402 -0.496414 -0.331957 -0.749809 -0.213846 -0.633706 -0.211708 -0.731665 -0.294359 -0.515706 -0.217068 -0.231402 -0.617131 -0.176786 -0.021711 0.083919 0.302602 0.146565 0.249010 0.146765 0.323441 0.180070 -0.012925 0.157986
polarizability: 2.98486930e+02 -1.39276360e+01 2.25557706e+02 2.68340841e+01 9.58449462e+00 1.68335689e+02
1716.lowfreq: -9.7845 -8.1294 -0.0022 -0.0020 -0.0018 5.5326 5.5734 22.1779 37.4183
frequency: -6.0975 21.6535 37.0953 41.1002 43.1337 54.2913 61.9629 75.3478 81.2305 97.9914 109.9984 117.5091 127.1966 135.4364 148.6862 159.1179 172.5760 179.5426 197.0894 199.4825 208.9519 218.1963 226.3995 231.4705 245.7245 259.7224 269.2875 273.4348 286.3630 311.6403 314.5594 323.1169 337.9418 346.3715 353.5095 360.7250 371.2050 381.7068 388.7587 396.0220 404.4314 416.5560 434.6012 470.9710 499.1524 517.4183 521.2611 538.4821 568.2252 577.8135 599.3601 643.3714 672.5002 681.9246 694.5375 698.7362 707.4777 716.9720 731.2017 748.4735 751.1527 775.6856 783.4382 795.0082 810.3357 823.1468 825.0013 841.2036 856.4648 896.2814 927.0378 935.1336 943.4321 947.4721 980.5252 993.4231 1001.3270 1022.1965 1040.5511 1050.8994 1068.1676 1082.4151 1086.0518 1092.0662 1113.2591 1135.3162 1145.6774 1185.3007 1197.4969 1215.3136 1236.2489 1244.4957 1259.2748 1266.3604 1272.1956 1285.8295 1310.1953 1321.1703 1342.1099 1364.1570 1369.6078 1372.2569 1389.3312 1404.2471 1424.1739 1483.4556 1605.9071 1640.6997 1676.1245 2889.6240 2914.3530 2930.0812 2989.6032 3026.1941 3044.6472 3079.1257 3103.4180 3184.5826 3218.2780 3467.5340 3511.4153 3547.4992 3596.0661
redmass: 10.7569 10.8593 9.5385 12.5357 9.2713 10.0845 6.1766 8.4383 10.1039 11.0029 8.2324 10.2613 7.8777 7.4752 5.8326 8.1623 10.2805 5.0022 5.9313 9.6479 10.2861 10.2076 4.2704 4.1804 3.4624 6.2198 4.1768 4.8462 2.2608 6.9769 2.2879 5.8675 6.0618 6.0831 6.0543 9.6668 7.5919 8.7162 6.5159 4.7726 5.6106 5.6766 5.7233 4.8975 1.7651 11.3263 7.1071 7.2676 3.9097 6.9811 7.3347 5.6720 8.1782 3.1223 5.4531 8.4904 13.0124 2.5882 1.9468 7.7145 7.6532 2.6069 1.7573 5.7347 2.0086 3.5123 3.5121 3.8876 1.1560 5.7778 8.8346 1.6133 2.3486 2.4352 5.8114 9.6555 4.0830 3.0490 1.3097 7.3991 3.3429 2.4356 2.6152 3.6892 1.3594 1.4655 2.6064 1.7792 1.4393 2.2015 1.4544 1.4078 1.1995 1.5866 1.1522 1.2926 1.2601 1.2186 3.3507 1.2776 1.5456 1.6227 1.5599 1.5763 2.3718 1.0769 5.5841 9.8697 6.5346 1.0814 1.0818 1.0716 1.0670 1.0850 1.0849 1.0884 1.1028 1.0902 1.0987 1.0653 1.0774 1.0669 1.0668
irintensity: 0.2359 0.1529 0.9762 1.6818 0.8108 0.7689 1.3949 0.4759 4.0211 0.4786 4.7712 1.2444 8.7705 13.0727 4.3926 2.1024 9.0135 27.7510 13.5794 3.4758 16.4495 2.4452 5.7661 8.8104 33.5424 4.6103 38.4614 13.0464 79.5519 42.9555 60.2526 61.4439 25.7218 44.3347 53.8988 119.8484 38.7350 21.1116 20.7048 28.3259 60.6949 1.8351 24.1738 7.7057 49.9415 51.8730 41.9343 21.7178 120.3416 19.9549 10.4576 10.1034 27.3314 15.5206 40.9349 174.9427 259.2841 31.9148 28.5066 55.3723 73.7745 511.6278 30.0519 295.0242 137.7912 123.2574 52.2219 17.6197 223.4633 31.1130 244.8288 6.3989 10.5900 42.0693 128.9984 179.8259 61.1347 118.6600 108.2217 181.5746 41.9085 16.6200 14.0467 191.7707 180.5678 7.9459 0.8310 2.2986 50.6424 35.4748 7.0062 7.6329 16.9623 98.7537 150.4909 26.8314 49.2799 3.6351 129.7316 6.4919 19.1461 5.3418 39.4860 24.8798 63.2830 15.8291 125.6325 488.3731 851.7977 2810.0790 76.3313 561.3856 84.3548 7.0044 8.7427 31.5348 6.4074 2.9776 1.4547 102.4019 79.5842 38.8470 156.6370
temp: 298.150 k
press: 1.00000 atm
elementType: 15 15 15 9 8 8 8 8 8 8 8 8 8 8 8 8 8 8 7 7 6 6 6 6 6 6 6 6 6 1 1 1 1 1 1 1 1 1 1 1 1 1 1
symmnumber: 1
zpe: 718357.9 jmol-1
zpe.correction: 0.273608 hartree
zpe.thermalcorrener: 0.303611 hartree
zpe.thermalcorrenthalpy: 0.304555 hartree
zpe.thermalcorrgfe: 0.212886 hartree
zpe.sumelectzpe: -2635.283264 hartree
zpe.sumelectthermal: -2635.253261 hartree
zpe.sumelectthermalent: -2635.252317 hartree
zpe.sumelectthermalfe: -2635.343986 hartree
dipole: -1.4339 -6.3450 -3.1012
dipole: 7.2064
quadrupole: -183.3002 -201.4871 -212.1851
quadrupole: 1.9574 -13.2945 5.4922
quadrupole: 15.6906 -2.4963 -13.1943 1.9574 -13.2945 5.4922
hfenergy: -2635.5568721 hartree
pointgroup: C01 [X(C9H14F1N2O14P3)]
dipole: 2.2694346 0.0831301 -1.6974394 debye
polarizability: 216.8926975|14.87564|284.4124634|-18.9234865|48.5699167|191.0751632 unknown
InChI: InChI=1S/C9H14FN2O14P3/c10-6-7(14)4(24-8(6)12-2-1-5(13)11-9(12)15)3-23-28(19,20)26-29(21,22)25-27(16,17)18/h1-2,4,6-8,11,14,16-17,19,21H,3H2
charge 0 multiplicity 1
43 atoms
P  0.688831 4.127848 -0.092405
P  -1.338104 3.013001 2.067915
P  -2.69234 0.787918 0.381956
F  2.652239 -0.905612 1.964894
O  0.415515 -0.511068 -0.446616
O  3.779456 0.870816 0.206689
O  1.567177 2.991588 -1.009546
O  -1.421138 -2.812651 0.515616
O  0.269726 3.281959 1.350536
O  2.013991 5.115795 0.270753
O  -0.616461 4.84371 -0.684314
O  -0.36452 -6.274822 -2.424699
O  -1.579685 1.370704 1.684652
O  -2.417244 3.770819 0.965165
O  -1.379674 3.427844 3.580247
O  -4.175862 1.491679 0.819492
O  -2.960195 -0.772849 0.841515
O  -2.12011 1.174509 -1.046441
N  0.748802 -2.860686 -0.393471
N  -0.832325 -4.534747 -0.932646
C  2.699892 0.059348 -0.297701
C  1.2807 0.677384 -0.239805
C  2.523081 -1.222606 0.554443
C  1.031582 -1.613321 0.329872
C  0.912265 1.676198 -1.337574
C  -0.561366 -3.372959 -0.228962
C  1.623881 -3.421981 -1.331781
C  1.320083 -4.555101 -2.03798
C  0.030536 -5.224526 -1.857698
H  2.885416 -0.260148 -1.350974
H  1.097705 1.114686 0.760846
H  3.266792 -2.00999 0.352852
H  0.535658 -1.677329 1.315377
H  -0.188642 1.761499 -1.418378
H  1.340788 1.410054 -2.316837
H  3.66442 1.804086 -0.109601
H  2.575758 -2.905385 -1.470028
H  -1.772106 -4.927779 -0.805154
H  2.022957 -4.982867 -2.753193
H  1.793784 6.013618 0.629147
H  -1.965624 4.339382 0.236938
H  -4.141873 2.487249 0.731063
H  -2.275673 -1.524862 0.692631
