program: Gaussian 09
title: 000191731
version: EM64L-G09RevD.01
frameworkgroup: C1[X(C9H18O2S2)]
method: RPBEPBE
basis: SDD
operation: Freq
keyword: #p
keyword: freq=noraman
keyword: PBEPBE/SDD
title: #p freq=noraman PBEPBE/SDD
converged: YES YES NO NO
title: Mulliken charges:
elementType: S S O O C C C C C C C C C H H H H H H H H H H H H H H H H H H
charge: -0.039910 -0.033077 -0.420978 -0.234920 -0.441641 -0.364474 -0.328952 -0.349727 -0.428921 -0.412379 -0.473159 -0.652795 0.199009 0.282990 0.219589 0.196783 0.210651 0.210716 0.200769 0.232253 0.293269 0.203766 0.235472 0.237735 0.236407 0.208172 0.214786 0.245553 0.092628 0.085496 0.374888
chargesum: 0.00000
title: Mulliken charges with hydrogens summed into heavy atoms:
elementType: S S O O C C C C C C C C C
charge: 0.052718 0.052418 -0.046090 -0.234920 -0.158651 0.051898 0.092415 0.083295 -0.135651 0.026860 0.000983 0.015716 0.199009
polarizability: 1.44150721e+02 5.64317067e+00 1.34672269e+02 4.00573852e+00 -9.50605983e-02 1.20919153e+02
1716.lowfreq: -18.2484 -8.9458 -1.3401 -0.0023 -0.0014 -0.0008 13.1497 17.2631 27.2457
frequency: 10.1832 17.1135 26.6437 37.1846 49.2537 90.2641 112.0423 145.5942 162.8401 201.6257 208.8576 213.7021 237.3679 262.7267 285.3693 316.2325 338.4667 349.6278 394.2831 419.5991 453.7151 518.8703 538.9632 560.7393 574.3743 620.1767 686.6681 733.3286 788.8292 812.4861 829.9988 842.8485 882.5564 897.1199 925.0285 948.0601 997.6883 1014.7128 1034.2557 1066.6703 1085.3226 1095.8864 1100.0484 1115.5021 1135.9411 1152.3753 1175.8617 1187.9865 1231.3906 1251.6161 1263.8322 1280.9532 1281.9802 1287.1067 1309.0068 1312.4966 1344.8347 1348.3271 1356.2234 1361.7424 1386.4743 1439.8103 1456.5381 1459.9553 1463.2806 1465.9106 1472.7857 1480.6479 1668.3429 2416.0437 2420.8412 2944.6403 2951.8087 2970.1730 2976.8634 2986.3870 2999.9526 3001.8385 3014.0585 3026.5285 3032.7046 3040.4424 3052.8613 3061.7042 3094.6194 3094.9839 3501.2904
redmass: 6.6705 6.8107 8.3717 6.8159 4.0982 4.1325 3.5599 5.1418 2.3480 1.5749 1.2485 1.4631 1.0925 2.7239 2.3183 2.5592 3.0618 3.0445 2.4672 3.2298 2.2225 3.2702 3.0897 3.9824 3.9012 1.7403 1.9488 1.3504 1.7461 1.1224 1.4801 1.7687 2.0194 1.7808 1.8927 1.8824 2.2801 2.1141 2.0815 2.0911 1.8018 2.0487 2.7406 2.7001 1.9331 1.3551 1.1902 1.2933 1.3071 1.2555 1.5234 1.1986 1.2393 1.1915 1.1447 1.3285 1.5833 1.4284 1.5790 1.4875 1.2067 1.0846 1.0788 1.0848 1.1049 1.0450 1.0484 1.0855 8.2629 1.0381 1.0381 1.0598 1.0598 1.0372 1.0620 1.0632 1.0962 1.0934 1.0646 1.0894 1.0886 1.0993 1.1020 1.0973 1.0978 1.0985 1.0637
irintensity: 0.2345 0.8278 1.1476 0.5473 0.3479 0.2492 0.5926 0.4543 0.0896 2.9385 45.0359 8.2405 3.1334 1.4558 1.0835 0.7474 1.5314 3.5452 4.3996 3.6553 1.6279 30.9181 3.6878 11.0182 5.3873 67.9157 106.8103 14.1733 6.1110 14.3264 4.9033 8.5628 11.8100 2.4521 5.3001 9.7658 7.4462 28.1852 107.1432 66.9416 13.3166 4.3508 3.6051 28.3392 23.9312 2.8415 21.8092 2.9379 11.6741 7.3132 0.9665 23.3790 6.2880 0.6656 8.2028 3.8471 3.4397 4.7002 19.2739 10.6280 15.2058 4.2728 7.6347 11.1432 22.3931 15.6626 7.0857 14.8876 208.7457 21.2248 28.0274 1.6281 43.2527 33.9570 23.6041 34.1647 19.3415 4.1530 18.4493 3.7101 3.5493 43.6430 29.8466 37.8549 26.0854 22.6211 18.8734
temp: 298.150 k
press: 1.00000 atm
elementType: 16 16 8 8 6 6 6 6 6 6 6 6 6 1 1 1 1 1 1 1 1 1 1 1 1 1 1 1 1 1 1
symmnumber: 1
zpe: 664920.3 jmol-1
zpe.correction: 0.253255 hartree
zpe.thermalcorrener: 0.270423 hartree
zpe.thermalcorrenthalpy: 0.271367 hartree
zpe.thermalcorrgfe: 0.204005 hartree
zpe.sumelectzpe: -1299.260978 hartree
zpe.sumelectthermal: -1299.243810 hartree
zpe.sumelectthermalent: -1299.242866 hartree
zpe.sumelectthermalfe: -1299.310227 hartree
dipole: 0.4475 0.4467 4.3356
dipole: 4.3814
quadrupole: -108.3171 -87.2791 -100.7532
quadrupole: 1.3615 0.6290 1.0597
quadrupole: -9.5340 11.5040 -1.9701 1.3615 0.6290 1.0597
hfenergy: -1299.5142327 hartree
pointgroup: C01 [X(C9H18O2S2)]
dipole: -0.1868289 -0.3319947 -1.681164 debye
polarizability: 143.7454258|-4.6291136|133.8892846|5.381819|-4.0739565|122.1074321 unknown
InChI: InChI=1S/C9H18O2S2/c1-7(12)6-8(13)4-2-3-5-9(10)11/h7-8,10,12-13H,2-6H2,1H3
charge 0 multiplicity 1
31 atoms
S  -0.897337 -1.015409 1.596128
S  -4.401726 1.278065 0.653167
O  3.121365 -1.876888 -0.007787
O  4.332255 -0.233504 1.096883
C  -1.233279 0.265141 0.206831
C  0.056281 0.591595 -0.576307
C  -2.374808 -0.213886 -0.713518
C  1.148392 1.28902 0.263166
C  -3.745773 -0.389506 -0.029419
C  2.450867 1.586491 -0.517807
C  3.193691 0.31938 -1.0275
C  -4.786795 -1.045438 -0.951105
C  3.624791 -0.569309 0.122314
H  -1.57327 1.149613 0.77906
H  0.447867 -0.345322 -1.022021
H  -0.221988 1.252455 -1.425674
H  -2.08693 -1.183917 -1.172281
H  -2.480299 0.51012 -1.549525
H  0.744152 2.245988 0.650598
H  1.374926 0.669599 1.152648
H  -3.618032 -0.983743 0.893985
H  2.22887 2.227629 -1.393909
H  3.141477 2.153277 0.134289
H  2.576958 -0.262979 -1.729917
H  4.10944 0.634846 -1.563028
H  -4.936712 -0.450736 -1.872525
H  -4.449814 -2.056521 -1.251993
H  -5.760815 -1.141019 -0.442568
H  -0.391478 -1.98732 0.743842
H  -4.632214 1.844455 -0.592806
H  3.425538 -2.41868 0.771579
