program: Gaussian 09
title: 000182342
version: EM64L-G09RevD.01
frameworkgroup: C1[X(C21H16O5)]
method: RPBEPBE
basis: SDD
operation: Freq
keyword: #pfreq=noraman
keyword: PBEPBE/SDD
title: #p freq=noraman PBEPBE/SDD
converged: YES YES NO NO
title: Mulliken charges:
elementType: O O O O O C C C C C C C C C C C C C C C C C C C C C H H H H H H H H H H H H H H H H
charge: -0.285959 -0.243422 -0.272408 -0.262438 -0.247242 0.202584 0.228229 0.145626 -0.211577 0.098815 0.187335 -0.320893 -0.683717 -0.683775 -0.403086 -0.383138 0.175875 0.016776 0.393396 -0.331524 -0.527375 0.194085 -0.369632 0.168504 -0.349062 -0.202436 0.238230 0.268588 0.208654 0.237490 0.238929 0.238864 0.237752 0.208630 0.258761 0.286617 0.273165 0.259157 0.285571 0.251939 0.236712 0.237399
chargesum: 0.00000
title: Mulliken charges with hydrogens summed into heavy atoms:
elementType: O O O O O C C C C C C C C C C C C C C C C C C C C C
charge: -0.285959 -0.243422 -0.272408 -0.262438 -0.247242 0.202584 0.228229 0.145626 0.026653 0.098815 0.187335 -0.052305 0.001356 0.001471 -0.144325 -0.096520 0.175875 0.016776 0.393396 -0.058359 -0.268217 0.194085 -0.084062 0.168504 -0.097123 0.271674
polarizability: 4.76210416e+02 -1.68970421e+01 2.33311241e+02 -7.35205844e-01 6.76888607e-01 1.25172741e+02
1716.lowfreq: -51.6821 -29.5235 -1.7286 -0.0007 0.0002 0.0005 3.3547 6.6071 26.8212
frequency: -51.6804 -29.4402 26.7600 37.9981 56.1052 77.8458 100.2598 122.1766 158.4683 176.8723 187.9143 198.2591 217.7546 232.3268 243.7907 271.5749 279.4457 285.2876 310.0224 332.1467 363.7891 376.2526 384.3381 413.1854 431.9991 445.8032 459.1828 474.1163 494.4142 503.8100 524.8355 559.7844 573.2683 584.4894 597.9788 616.6824 628.2837 636.5667 675.1470 691.5828 716.2652 723.9453 764.6312 772.9867 782.0001 796.1295 803.3714 818.8923 820.2681 843.7702 845.3878 859.2123 861.1277 877.8229 882.6259 920.6811 922.3618 937.2446 943.4750 978.3290 982.5303 982.8103 996.0861 1022.0935 1035.8992 1065.0704 1065.7899 1106.3485 1119.3600 1138.5874 1148.0737 1182.9146 1190.8592 1193.5461 1212.1149 1221.1928 1250.2769 1262.9371 1268.1024 1278.9084 1315.7857 1339.9125 1364.4063 1369.8772 1373.6387 1378.7199 1393.0509 1405.8607 1437.3812 1449.3846 1450.6366 1459.5317 1469.1831 1470.5690 1478.7455 1482.1736 1487.5329 1539.3077 1560.2069 1590.5370 1606.4201 1617.9243 1627.1941 1657.7303 2989.0461 2992.0929 3011.1534 3087.9805 3088.7614 3093.7240 3101.8208 3105.4932 3131.5041 3158.5191 3166.1999 3171.6009 3176.3210 3179.0039 3188.9727 3200.7796
redmass: 2.3097 3.4410 6.9394 5.4017 6.3067 6.2062 6.5263 5.4737 5.3734 6.5997 1.0359 4.9414 5.5063 1.3207 3.2850 4.2374 3.8013 3.9532 5.4280 4.8530 4.6428 3.7499 4.4632 3.4005 3.8554 4.5685 3.6823 6.4284 3.3887 9.3969 8.1668 6.2350 6.5718 4.0988 5.9159 6.0563 6.2214 7.1016 8.1738 7.1189 4.0008 2.8099 5.2847 2.3450 5.3916 7.3625 3.3132 1.6887 4.1233 6.8045 1.7778 1.8561 1.7661 2.0174 3.3780 1.5670 2.8048 1.3824 2.5176 5.9546 1.2883 1.2959 1.3151 3.4641 3.1477 1.4623 4.9308 1.5828 1.0366 1.7219 1.4386 2.0418 3.9295 2.1865 1.9468 2.4877 2.1529 3.3700 3.2786 1.5913 2.0235 2.5064 1.3253 2.0488 1.2148 3.5674 1.3872 5.1487 3.6125 4.6521 1.0488 1.0475 1.4158 2.1227 2.1197 1.0910 1.3736 9.2442 8.0842 8.0728 8.0204 8.3382 8.3712 7.8333 1.0349 1.0353 1.0533 1.0995 1.1190 1.0992 1.1015 1.1009 1.0872 1.0883 1.0924 1.0971 1.0907 1.0969 1.0941 1.0954
irintensity: 14.1641 0.2692 0.2020 0.8761 0.5543 1.2619 0.8001 3.7206 0.5273 0.2136 0.1077 0.3115 0.1977 0.3612 1.0185 3.0697 4.6774 2.6023 0.2039 11.8047 1.0429 0.4006 2.1592 3.3228 7.0404 4.8229 7.4152 3.3079 0.2229 0.6303 29.8156 3.7930 6.1688 5.7554 3.6566 3.5776 19.6670 4.3776 3.9168 1.6359 2.9151 15.3789 16.6488 35.7481 13.6037 11.0295 5.8337 64.0552 9.4707 19.4009 36.4943 24.7852 18.3189 3.9003 13.9054 0.0901 0.2764 2.5220 3.9319 207.6109 0.3951 1.3730 0.4499 111.3715 8.5732 4.7639 101.9822 182.7628 0.0919 47.3102 2.3160 260.1208 30.5220 3.0102 17.5812 194.0514 104.5763 124.2730 166.0224 91.4971 6.6514 21.2233 0.5065 205.8477 26.0890 9.7516 4.6915 1.3531 82.2173 59.0675 5.2315 1.1244 1.1927 17.9048 164.4917 14.8067 52.7766 127.6663 45.7832 69.6900 12.4737 222.7615 2.6322 58.6769 12.1136 31.8709 157.4685 2.3199 33.4773 32.4899 13.2720 37.7176 4.4489 1.1061 2.9325 10.9893 4.2435 6.1931 12.2713 3.5926
temp: 298.150 k
press: 1.00000 atm
elementType: 8 8 8 8 8 6 6 6 6 6 6 6 6 6 6 6 6 6 6 6 6 6 6 6 6 6 1 1 1 1 1 1 1 1 1 1 1 1 1 1 1 1
symmnumber: 1
zpe: 828493.1 jmol-1
zpe.correction: 0.315556 hartree
zpe.thermalcorrener: 0.335557 hartree
zpe.thermalcorrenthalpy: 0.336502 hartree
zpe.thermalcorrgfe: 0.267166 hartree
zpe.sumelectzpe: -1184.101338 hartree
zpe.sumelectthermal: -1184.081336 hartree
zpe.sumelectthermalent: -1184.080392 hartree
zpe.sumelectthermalfe: -1184.149728 hartree
dipole: 3.2858 -4.1080 -0.6592
dipole: 5.3016
quadrupole: -111.8316 -148.3396 -151.8664
quadrupole: 1.3679 -1.2301 -0.8363
quadrupole: 25.5143 -10.9937 -14.5206 1.3679 -1.2301 -0.8363
hfenergy: -1184.4168939 hartree
pointgroup: C01 [X(C21H16O5)]
dipole: -1.305635 -1.5753823 -0.4049962 debye
polarizability: 476.4669136|14.0445971|216.2407219|5.1491824|39.1355844|141.9867617 unknown
InChI: InChI=1S/C21H16O5/c1-21(2)8-7-13-16(26-21)6-4-14-19(22)15(10-23-20(13)14)12-3-5-17-18(9-12)25-11-24-17/h3-10H,11H2,1-2H3
charge 0 multiplicity 1
42 atoms
O  -5.188159 0.697002 0.091351
O  -0.754629 -1.274955 -0.106022
O  5.79121 -1.547385 -1.344271
O  6.980468 -0.106672 0.170336
O  0.986514 2.428481 0.775718
C  -5.904462 -0.611404 -0.221534
C  -2.967473 -0.35151 -0.024792
C  -3.805824 0.778228 0.17476
C  -4.934505 -1.764084 -0.41981
C  -1.571219 -0.144052 0.086442
C  -0.993931 1.116173 0.382155
C  -3.581951 -1.644133 -0.328749
C  -6.829624 -0.858044 0.989454
C  -6.709261 -0.326684 -1.50788
C  -3.264304 2.058766 0.472317
C  -1.877377 2.216543 0.573119
C  1.284142 0.067929 0.229745
C  0.473755 1.294938 0.488776
C  2.771816 0.084637 0.235169
C  0.624557 -1.117771 -0.018496
C  3.492173 -0.790794 -0.642951
C  4.88273 -0.778133 -0.571419
C  3.490345 0.941891 1.114802
C  5.58189 0.067542 0.314635
C  4.90873 0.944473 1.167658
C  7.147406 -1.126983 -0.900139
H  -5.400179 -2.730266 -0.647539
H  -2.927915 -2.507239 -0.480058
H  -7.457943 -1.750844 0.816896
H  -7.489645 0.013408 1.142494
H  -6.236625 -1.018495 1.905441
H  -6.031397 -0.119893 -2.352951
H  -7.363583 0.549147 -1.355716
H  -7.339186 -1.197013 -1.767393
H  -3.950197 2.897822 0.61647
H  -1.427512 3.187878 0.800455
H  1.120859 -2.080416 -0.156919
H  2.978819 -1.420066 -1.375242
H  2.931898 1.629392 1.751799
H  5.45012 1.60984 1.844381
H  7.675978 -2.001248 -0.482932
H  7.67909 -0.668503 -1.752063
