program: Gaussian 09
title: 000182341
version: EM64L-G09RevD.01
frameworkgroup: C1[X(C21H22O5)]
method: RPBEPBE
basis: SDD
operation: Freq
keyword: #pfreq=noraman
keyword: PBEPBE/SDD
title: #p freq=noraman PBEPBE/SDD
converged: YES YES NO NO
title: Mulliken charges:
elementType: O O O O O C C C C C C C C C C C C C C C C C C C C C H H H H H H H H H H H H H H H H H H H H H H
charge: -0.305941 -0.267863 -0.236411 -0.274170 -0.261397 0.338584 -0.405978 0.075259 0.281502 -0.399398 -0.822140 0.295980 0.134515 -0.584192 0.516075 -0.515072 -0.026936 -0.534756 -0.536095 -0.391454 0.189724 -0.543554 -0.347673 -0.580951 0.154745 -0.204544 0.286646 0.244873 0.227129 0.219845 0.261921 0.196227 0.241418 0.268707 0.196445 0.243268 0.222048 0.232028 0.250365 0.246581 0.242874 0.266678 0.233551 0.252637 0.208783 0.238944 0.240278 0.230900
chargesum: 0.00000
title: Mulliken charges with hydrogens summed into heavy atoms:
elementType: O O O O O C C C C C C C C C C C C C C C C C C C C C
charge: -0.305941 -0.267863 -0.236411 -0.274170 -0.261397 0.338584 -0.119332 0.075259 0.281502 -0.154525 -0.113246 0.295980 0.134515 -0.146547 0.516075 -0.246365 0.169508 0.162587 -0.285731 -0.144874 0.189724 0.199548 -0.095037 -0.133224 0.154745 0.266634
polarizability: 2.77109663e+02 2.10077218e+01 2.52281097e+02 -7.35347749e+00 1.73396246e+01 1.79811752e+02
1716.lowfreq: -5.2553 -0.0007 0.0001 0.0007 6.6296 10.1206 34.7374 36.6426 45.7316
frequency: 34.7037 36.6189 45.7089 53.6258 68.9785 88.6361 95.7088 112.1177 119.4290 127.6603 139.8711 150.6158 153.6973 170.8472 175.4565 188.4228 205.8167 214.2265 222.6989 234.0646 239.5118 251.3111 281.7575 310.9960 340.2879 351.4473 373.2477 396.8639 404.3326 412.9890 424.3302 443.1604 461.6119 495.0772 516.3547 521.0929 560.7011 577.1237 598.8258 624.3161 636.7117 654.4670 676.0342 700.7996 715.6934 740.4215 745.6632 772.0059 787.9664 809.6758 820.4063 838.5764 851.2316 857.4673 877.9514 888.9704 894.0231 915.6202 934.6849 938.4086 946.6219 949.4302 951.2895 956.4904 969.9244 979.9485 997.9371 1019.0701 1042.6590 1058.6456 1069.1699 1072.0051 1084.6176 1105.7471 1116.3934 1120.1057 1129.6822 1135.5372 1147.1498 1156.5529 1163.2672 1166.5583 1189.1976 1191.3000 1207.7338 1230.5385 1252.7761 1261.9927 1271.9988 1285.2685 1290.2856 1305.1106 1310.2154 1332.0897 1362.0346 1376.3310 1389.5170 1399.6761 1420.6622 1426.2203 1437.3545 1440.2258 1447.8208 1459.2274 1469.9470 1472.7331 1475.1910 1477.7465 1478.1464 1487.0305 1489.4544 1557.3588 1606.4492 1610.7853 1629.3819 1658.8547 2967.6655 2970.9018 2977.1068 2988.9429 2989.4059 2994.3184 3047.7548 3055.7522 3060.4839 3072.7618 3096.1518 3096.3550 3098.2207 3108.6666 3117.4232 3131.7008 3144.5631 3155.6304 3169.0352 3176.5917 3182.1787 3201.7470
redmass: 5.1731 5.5734 3.5660 4.1144 3.8079 4.5361 2.6758 2.8194 2.6929 3.4166 3.8305 3.0504 1.1174 3.6601 1.2363 3.6889 3.4345 3.3403 1.9708 2.2070 3.6608 3.3998 3.6811 5.8811 5.1517 5.4910 4.5432 3.3640 3.5732 2.8721 3.0621 3.7303 4.7077 3.9541 4.1899 5.3379 4.8093 5.3046 2.9844 5.9799 3.6322 4.9854 8.7377 3.4981 5.0084 3.0330 3.4666 4.1895 3.6803 3.3034 1.9519 5.9828 3.5457 2.1573 1.7057 1.5832 2.3823 4.2766 2.7734 1.4089 3.1603 1.5342 1.7293 3.9906 3.2486 3.7875 1.1175 1.9517 2.2771 3.7808 1.7598 1.5074 2.7092 2.1950 1.2660 1.3132 1.0881 1.3920 1.9946 1.6140 1.5187 1.5416 2.2015 1.8590 2.2987 3.1240 1.7440 2.1511 1.7241 2.6350 1.4087 1.6213 1.6325 2.8156 1.3328 2.6796 1.7354 2.8404 1.1571 1.1594 1.2155 4.1456 1.1218 1.0540 1.0764 1.0651 1.0626 1.4719 1.0638 1.7422 1.0572 10.5194 7.9613 7.9097 8.2553 4.7073 1.0312 1.0639 1.0381 1.0778 1.0343 1.0616 1.0944 1.0983 1.1039 1.0810 1.1040 1.0736 1.0973 1.1094 1.1018 1.1041 1.0899 1.0941 1.0919 1.0919 1.0955 1.1153
irintensity: 0.5177 0.2720 0.1606 1.1559 0.0968 6.1538 10.8998 1.0486 4.3595 2.1539 9.0451 0.4048 0.9427 7.3440 0.9386 0.9349 0.9444 0.0206 1.4325 2.1208 2.1492 4.9514 1.6761 0.8092 3.0314 6.9938 10.0946 2.3038 8.8572 4.3255 4.2217 0.4479 1.0563 4.3161 2.8883 2.0378 7.7774 8.3758 24.0578 0.1057 4.7694 7.1826 1.4295 12.5953 0.7157 2.8333 13.7629 9.1055 10.5926 14.5014 31.7458 28.1397 4.6343 14.0728 26.9992 29.9140 6.0517 14.1199 8.5966 2.6234 4.9259 83.5062 4.5926 60.8222 2.3223 112.8754 28.4797 5.9849 19.7599 24.4889 15.7673 8.3276 65.5020 60.1005 13.5347 3.1297 0.4340 15.2843 30.2801 0.7552 6.9129 27.0291 120.7178 33.4024 2.0223 65.7310 31.9198 86.0608 1.4563 22.6581 4.5701 34.2470 20.6527 71.8391 1.7401 9.5667 7.4706 25.1979 7.7019 3.6735 3.9475 55.4432 25.8455 8.4418 2.4901 16.3572 11.8104 67.0725 4.1800 80.8198 26.6071 111.8968 210.6724 7.2005 0.4404 14.4495 56.9665 23.6420 31.3200 34.0917 42.6807 127.3178 1.2152 20.7437 29.9874 24.4840 14.5812 13.9949 9.3319 32.4850 23.0853 15.4527 5.2781 12.6982 1.0322 5.9543 1.8231 25.2209
temp: 298.150 k
press: 1.00000 atm
elementType: 8 8 8 8 8 6 6 6 6 6 6 6 6 6 6 6 6 6 6 6 6 6 6 6 6 6 1 1 1 1 1 1 1 1 1 1 1 1 1 1 1 1 1 1 1 1 1 1
symmnumber: 1
zpe: 993641.2 jmol-1
zpe.correction: 0.378458 hartree
zpe.thermalcorrener: 0.403462 hartree
zpe.thermalcorrenthalpy: 0.404406 hartree
zpe.thermalcorrgfe: 0.324263 hartree
zpe.sumelectzpe: -1187.493970 hartree
zpe.sumelectthermal: -1187.468966 hartree
zpe.sumelectthermalent: -1187.468022 hartree
zpe.sumelectthermalfe: -1187.548165 hartree
dipole: -0.0109 4.1970 2.3350
dipole: 4.8029
quadrupole: -137.8597 -149.3769 -157.4346
quadrupole: -3.1515 -7.4706 -7.4952
quadrupole: 10.3640 -1.1531 -9.2109 -3.1515 -7.4706 -7.4952
hfenergy: -1187.872428 hartree
pointgroup: C01 [X(C21H22O5)]
dipole: -0.0746919 -1.6579169 -0.903498 debye
polarizability: 273.6302655|-22.8665764|255.3698815|12.1106196|15.1759478|180.2023652 unknown
InChI: InChI=1S/C21H22O5/c1-5-8-20-15(22)10-16(23-3)21(24-4)18(20)19(21,2)17(20)12-6-7-13-14(9-12)26-11-25-13/h5-7,9-10,17-18H,1,8,11H2,2-4H3
charge 0 multiplicity 1
48 atoms
O  -2.02081 -2.724745 -0.45246
O  -0.333123 -2.312821 1.858314
O  -1.31739 2.34586 1.721279
O  4.214714 -1.172478 -0.178068
O  5.043526 0.962378 0.537399
C  -1.03293 -0.715637 -1.530498
C  -2.316782 -0.267166 -0.774567
C  -1.476851 -1.409654 -0.194464
C  -1.685552 1.090083 -0.357485
C  -0.388058 0.666505 -1.253747
C  -0.868433 -1.496618 -2.813839
C  -0.847155 -1.220586 1.15951
C  -1.335727 1.212878 1.1399
C  -2.427681 2.341165 -0.881469
C  1.035443 0.781381 -0.742123
C  -0.876185 -0.006571 1.805091
C  -3.881324 2.410198 -0.44486
C  -3.149943 -3.075354 0.433732
C  1.885964 -0.362466 -0.724715
C  1.536572 2.039467 -0.317104
C  3.190432 -0.189725 -0.26291
C  0.427654 -3.350795 1.118133
C  2.8699 2.202854 0.143842
C  -4.358792 3.222035 0.530743
C  3.676323 1.062744 0.162349
C  5.330665 -0.494897 0.5376
H  -3.364618 -0.434161 -1.033924
H  -0.481623 1.26576 -2.180844
H  0.18884 -1.773208 -2.985383
H  -1.196413 -0.892285 -3.680355
H  -1.4652 -2.423058 -2.785858
H  -2.383467 2.341142 -1.989871
H  -1.890668 3.234899 -0.51508
H  -0.450559 0.088318 2.808526
H  -4.582094 1.746819 -0.977119
H  -2.81549 -3.153703 1.484942
H  -3.959957 -2.324903 0.357839
H  -3.509895 -4.052786 0.077676
H  1.530096 -1.340462 -1.05705
H  0.872486 2.910491 -0.322782
H  1.418145 -2.946333 0.842515
H  -0.1273 -3.686929 0.22687
H  0.548569 -4.175544 1.835967
H  3.246873 3.173643 0.474587
H  -5.421068 3.231527 0.802129
H  -3.687952 3.877411 1.098015
H  6.268825 -0.676433 -0.008377
H  5.358513 -0.857939 1.582992
