program: Gaussian 09
title: 000191726
version: EM64L-G09RevD.01
frameworkgroup: C1[X(C6H11N3O4)]
method: RPBEPBE
basis: SDD
operation: Freq
keyword: #p
keyword: freq=noraman
keyword: PBEPBE/SDD
title: #p freq=noraman PBEPBE/SDD
converged: YES YES NO NO
title: Mulliken charges:
elementType: O O O O N N N C C C C C C H H H H H H H H H H H
charge: -0.473295 -0.165485 -0.405397 -0.187178 -0.186028 -0.634454 -0.655349 -0.032696 -0.516731 -0.461727 0.148425 0.237207 0.104868 0.204519 0.287411 0.264833 0.211129 0.227298 0.362818 0.324440 0.298923 0.314580 0.341353 0.390534
chargesum: 0.00000
title: Mulliken charges with hydrogens summed into heavy atoms:
elementType: O O O O N N N C C C C C C
charge: -0.110476 -0.165485 -0.014863 -0.187178 -0.186028 -0.011090 0.000583 0.171823 0.035514 -0.023299 0.148425 0.237207 0.104868
polarizability: 1.38567644e+02 -4.47127923e+00 1.00686209e+02 2.66587369e+00 -3.93603460e+00 6.40337469e+01
1716.lowfreq: -14.0535 -7.3996 0.0005 0.0006 0.0007 4.2193 10.6881 28.8112 41.0197
frequency: 9.9746 28.7128 40.9456 47.5834 73.2088 121.7608 145.5180 195.9555 206.5368 272.8525 315.7366 324.3372 330.0639 368.6241 405.0975 419.1455 438.2564 455.4995 475.4296 533.8980 554.9679 569.9434 610.5231 630.0745 671.6038 677.6247 702.0383 794.3247 847.9970 879.0093 914.6507 1001.9932 1019.6002 1028.8698 1032.1078 1041.5496 1049.8569 1115.4700 1155.4491 1183.5707 1225.9042 1268.3933 1287.4325 1308.5163 1319.5543 1347.7828 1405.9670 1417.1578 1435.6984 1451.9302 1607.6285 1622.6479 1628.2112 1658.2654 1680.9323 2911.3850 2947.4570 2982.5620 2985.4123 3029.1056 3240.0385 3500.1519 3539.0395 3560.1009 3685.8768 3702.1029
redmass: 9.5578 6.3983 4.1912 3.9216 5.4940 4.6167 4.4730 4.0697 3.0478 3.7695 1.4317 3.5787 6.0694 3.0432 1.4527 2.4143 1.2898 2.1188 3.3884 1.3092 2.5385 3.2574 1.4632 4.5810 3.4493 2.2239 1.3591 5.9135 2.7786 2.4855 4.1855 2.4035 2.7994 2.2672 2.0562 2.1868 3.1667 2.0796 1.3271 2.1779 1.2515 1.5663 1.2662 1.4247 1.2925 1.5501 1.0950 2.0112 2.6820 1.1391 1.2230 1.2695 9.7963 10.2794 3.9791 1.0589 1.0834 1.0784 1.0850 1.0939 1.0631 1.0643 1.0452 1.0454 1.1026 1.1037
irintensity: 2.8419 2.8146 2.0724 3.2112 3.2850 7.2996 0.8612 8.1538 20.4843 15.8539 54.7933 4.6848 10.8449 3.9455 182.7485 54.8937 77.4305 9.3254 16.0250 259.6741 36.1816 12.1492 92.6054 35.0368 21.4364 39.2220 237.4810 23.2602 14.4491 4.9319 12.7206 15.0042 49.6632 147.8339 115.4167 3.1563 23.5307 21.2544 4.6410 2.8720 3.1971 26.8095 25.3503 20.0751 64.7040 98.2396 50.1754 95.5878 125.3724 54.2940 160.2696 68.3687 149.8052 107.9330 630.0898 52.4984 35.3001 29.4475 42.5305 9.2776 219.8573 23.4097 33.7941 22.9993 23.9860 27.2653
temp: 298.150 k
press: 1.00000 atm
elementType: 8 8 8 8 7 7 7 6 6 6 6 6 6 1 1 1 1 1 1 1 1 1 1 1
symmnumber: 1
zpe: 481135.7 jmol-1
zpe.correction: 0.183255 hartree
zpe.thermalcorrener: 0.198022 hartree
zpe.thermalcorrenthalpy: 0.198966 hartree
zpe.thermalcorrgfe: 0.138322 hartree
zpe.sumelectzpe: -699.355705 hartree
zpe.sumelectthermal: -699.340938 hartree
zpe.sumelectthermalent: -699.339993 hartree
zpe.sumelectthermalfe: -699.400638 hartree
dipole: 3.6645 -1.3108 -2.2093
dipole: 4.4753
quadrupole: -45.2544 -83.8723 -77.2562
quadrupole: -19.1913 5.7810 5.2064
quadrupole: 23.5399 -15.0780 -8.4619 -19.1913 5.7810 5.2064
hfenergy: -699.5389598 hartree
pointgroup: C01 [X(C6H11N3O4)]
dipole: -1.5135533 0.8084148 -0.3946155 debye
dipolederiv: -0.7790041 0.0295909 -0.0812646 0.0060635 -0.6990667 -0.1357995 -0.1328103 -0.1024308 -0.6001309 -0.6280679 -0.0651684 0.106179 -0.0780236 -0.3190473 -0.1018542 0.04472 -0.1125104 -0.6612962 -0.5168133 0.1642815 0.3626734 0.1034085 -0.4237721 -0.1483998 0.2750499 -0.2016286 -0.9819127 -0.6924856 -0.2533431 -0.2168985 -0.1596637 -0.4935499 -0.2845892 0.0326134 -0.1631323 -0.6362115 -1.5791379 0.1790513 0.0467422 0.5478695 -0.583201 -0.0767808 0.1986903 -0.0559889 -0.4092876 -1.2529359 -0.1660011 -0.3119399 -0.1580247 -0.5575372 0.1446229 -0.5018036 0.0988112 -0.5820824 -0.5154106 0.0339217 0.2136352 0.2462987 -0.9745915 -0.1963097 0.3237016 -0.2361477 -0.7942844 0.5206366 0.03481 0.1233263 0.0563534 0.4169122 0.0599929 0.1901258 -0.0152862 0.4487579 -0.1606018 -0.1022044 -0.0585232 -0.0893195 -0.0638158 -0.1959416 -0.1397986 -0.2045023 -0.3099279 0.5427879 0.0900267 0.0194384 0.0364926 0.058182 -0.1293115 0.002016 -0.1018315 0.233254 0.8791289 0.2602604 0.0360726 0.2925158 0.3690708 0.2696716 0.0663654 0.2339694 0.8071071 2.0743371 -0.0856452 0.0694134 -0.337452 1.1991481 0.4866053 -0.0368706 0.4455364 0.4727566 0.7614328 0.1227603 -0.1602666 0.0820933 0.4968274 0.4612367 -0.2701505 0.4211735 1.219301 -0.0077557 -0.0156052 -0.0172582 0.0376756 -0.0606496 0.0835889 -0.0411123 0.0816449 -0.1726244 -0.018427 0.0575258 -0.0231202 0.0963284 0.0683634 -0.0213721 0.0410703 0.0071054 0.144409 0.0970151 -0.0273807 -0.0478089 -0.0442005 0.0145931 0.0860615 0.0390233 0.0956682 0.0558408 -0.0965079 -0.0403771 0.0222264 -0.1406945 -0.0929172 0.0997564 0.0447092 0.131823 -0.0300268 0.0130882 0.0006097 0.0138071 -0.0613149 0.0113356 -0.0786907 -0.0476833 -0.0935822 -0.1088402 0.4618071 -0.1431902 -0.0612727 -0.2391332 0.4291409 0.0567365 -0.1252831 0.0629675 0.3146317 0.2278937 0.0314363 0.0540304 0.0068005 0.1988647 -0.0950936 0.0762831 -0.0647454 0.3265563 0.1879304 -0.0066938 0.0621406 -0.1095906 0.2516482 -0.1142537 0.1808297 -0.0949639 0.2492589 0.1654434 0.0354162 -0.0690465 0.0814246 0.1928593 -0.0917298 -0.0957513 -0.0291072 0.3507274 0.1753008 -0.0134887 -0.0658408 -0.0283592 0.2429629 -0.0374546 -0.0698425 -0.0500248 0.3281087 0.1403456 -0.1205928 -0.016445 -0.147548 0.3182397 -0.040692 -0.0540918 -0.052817 0.3359158 unknown
polarizability: 138.9006162|3.4899622|80.5164385|-3.4096691|18.2489836|83.8705449 unknown
InChI: InChI=1S/C6H11N3O4/c7-6(8)9-2-3(10)1-4(11)5(12)13/h3,10,12H,1-2,7-8H2
charge 0 multiplicity 1
24 atoms
O  -0.570241 -1.63312 -1.318524
O  1.313611 0.673685 1.815092
O  3.821359 0.567122 -0.737468
O  3.933034 1.698364 1.296253
N  -2.565645 -0.400575 -0.199021
N  -4.905847 -0.338724 -0.359262
N  -3.823695 1.449512 0.713871
C  -0.189316 -0.844023 -0.148778
C  1.215178 -0.301773 -0.436605
C  -1.270061 0.252189 0.081792
C  1.857117 0.447907 0.707128
C  -3.693662 0.221403 0.057666
C  3.303142 0.986765 0.493112
H  -0.163743 -1.490462 0.755428
H  1.877225 -1.140365 -0.731868
H  1.196085 0.349338 -1.335083
H  -1.094981 1.10239 -0.616699
H  -1.167398 0.629766 1.121108
H  -1.579219 -1.625728 -1.262521
H  -4.831728 -1.210546 -0.879495
H  -5.755345 -0.175769 0.177741
H  -4.672859 2.00229 0.62971
H  -3.003694 1.886196 1.124375
H  4.747387 0.91606 -0.85395
