program: Gaussian 09
title: 000191696
version: EM64L-G09RevD.01
frameworkgroup: C1[X(C4H8O3)]
method: RPBEPBE
basis: SDD
operation: Freq
keyword: #p
keyword: freq=noraman
keyword: PBEPBE/SDD
title: #p freq=noraman PBEPBE/SDD
converged: YES YES NO NO
title: Mulliken charges:
elementType: O O O C C C C H H H H H H H H
charge: -0.325604 -0.438003 -0.438029 -0.103069 -0.102760 -0.319867 -0.319993 0.251288 0.251171 0.200347 0.221169 0.200338 0.221159 0.350911 0.350941
chargesum: 0.00000
title: Mulliken charges with hydrogens summed into heavy atoms:
elementType: O O O C C C C
charge: -0.325604 -0.087092 -0.087088 0.148219 0.148411 0.101649 0.101505
polarizability: 6.69331086e+01 8.66831006e-04 4.89827890e+01 3.47276523e+00 6.52171595e-03 4.24610445e+01
1716.lowfreq: -21.1279 0.0008 0.0009 0.0011 1.0452 12.0738 58.1414 77.7504 153.6269
frequency: 58.1367 77.7362 153.6246 186.1994 323.5869 374.4124 410.5479 428.3240 437.6238 572.4115 656.9843 806.3327 903.1102 930.2708 977.7756 979.0921 1049.1151 1054.9414 1097.1115 1099.0792 1182.1071 1189.5827 1224.7682 1273.7030 1315.2366 1334.4970 1368.8520 1382.9397 1438.8595 1449.6942 1450.0027 2972.7027 2973.6613 3070.7879 3071.8642 3101.0008 3107.4521 3555.1566 3555.6881
redmass: 4.2438 5.5813 4.6194 2.3240 4.8409 1.9413 1.6691 1.4018 1.6578 3.5276 5.0114 4.5784 1.7152 3.4144 5.6402 1.9090 1.8397 1.4550 1.8119 1.8556 1.2616 1.3662 1.3741 1.2017 1.2441 1.1705 1.2029 1.2693 2.8794 1.0861 1.0823 1.0659 1.0669 1.0954 1.0955 1.0943 1.0885 1.0661 1.0660
irintensity: 7.5795 8.6984 5.8574 0.8822 3.2291 101.6720 0.0112 243.5310 12.0226 20.3414 22.5027 38.5078 0.4099 129.5348 45.5599 1.5684 62.4163 3.1353 5.1102 7.6793 19.6756 9.2982 0.0704 8.8139 4.6503 29.6622 4.0160 41.6673 7.3691 3.4758 8.1218 79.4129 14.9209 3.3751 27.1652 11.7574 37.2961 10.3172 7.4525
temp: 298.150 k
press: 1.00000 atm
elementType: 8 8 8 6 6 6 6 1 1 1 1 1 1 1 1
symmnumber: 1
zpe: 314587.8 jmol-1
zpe.correction: 0.119820 hartree
zpe.thermalcorrener: 0.127846 hartree
zpe.thermalcorrenthalpy: 0.128790 hartree
zpe.thermalcorrgfe: 0.086976 hartree
zpe.sumelectzpe: -382.245660 hartree
zpe.sumelectthermal: -382.237634 hartree
zpe.sumelectthermalent: -382.236690 hartree
zpe.sumelectthermalfe: -382.278504 hartree
dipole: 0.0007 -0.9667 0.0029
dipole: 0.9667
quadrupole: -58.4963 -38.1604 -40.5228
quadrupole: 0.0078 -3.7310 0.0088
quadrupole: -12.7698 7.5661 5.2037 0.0078 -3.7310 0.0088
hfenergy: -382.3654797 hartree
pointgroup: C01 [X(C4H8O3)]
dipole: 0.0228851 -0.3789116 0.0237469 debye
dipolederiv: -0.4943133 0.0158841 0.0807724 0.0150837 -0.6767676 0.0243937 0.067082 0.0236756 -0.3522193 -0.7097106 -0.2395717 0.0707431 -0.3534325 -0.3846012 -0.1043762 0.0941692 -0.091078 -0.5522306 -0.775572 0.1976619 0.0335638 0.3138333 -0.2975998 0.0842629 0.0447665 0.0730154 -0.5733925 0.1161347 -0.0597475 -0.0396205 -0.1095739 0.1866983 -0.0528045 0.0371223 -0.0146915 0.2369199 0.0971274 0.0430659 -0.0520687 0.1015339 0.2139389 0.0513528 0.0222315 0.0223165 0.2285022 0.5169374 0.1811949 0.0894431 0.201264 0.4180196 0.0945271 -0.0247465 0.0494487 0.3289118 0.5598328 -0.1506596 0.1199597 -0.1843779 0.3577804 -0.0880226 0.0041717 -0.0568592 0.3464457 0.0451953 0.0335806 0.0121558 0.0561438 0.074844 0.0080515 0.0098971 0.0470349 -0.1055743 0.0559212 -0.0335016 0.0185814 -0.0559374 0.0550853 -0.0263224 0.0235234 -0.065166 -0.0967824 -0.0135685 -0.0496489 -0.1011003 -0.0377244 0.0493994 0.0218549 -0.0522686 -0.0316066 -0.1777188 0.001769 0.0659681 -0.0116354 0.0268867 -0.1073314 0.007783 -0.0106396 0.043457 0.0963587 -0.0218732 0.029241 -0.1008413 0.0228136 0.0545456 -0.0611323 -0.0575688 -0.0021417 -0.1746418 0.0113403 -0.0526516 -0.0050017 -0.013418 -0.1199888 0.0164626 -0.0044987 -0.0191255 0.0996342 0.2889241 0.1572741 -0.0673671 0.1364657 0.1067424 0.0313511 -0.0854058 0.0305928 0.3455353 0.3218555 -0.1380897 -0.0475842 -0.1195606 0.0692348 -0.0073817 -0.0678357 -0.0088725 0.3502521 unknown
polarizability: 67.1732012|1.2059116|49.0383586|2.0533739|-0.2784372|42.1653823 unknown
InChI: InChI=1S/C4H8O3/c5-1-3-4(2-6)7-3/h3-6H,1-2H2
charge 0 multiplicity 1
15 atoms
O  -0.117073 1.059324 -0.009085
O  2.983604 0.454019 0.060184
O  -3.122816 0.088771 0.017578
C  0.637756 -0.205327 0.387393
C  -0.713603 -0.324375 -0.246043
C  1.910612 -0.435296 -0.398768
C  -1.955961 -0.608001 0.570581
H  0.723429 -0.31925 1.476719
H  -0.776393 -0.57721 -1.31329
H  1.709695 -0.303137 -1.482459
H  2.295998 -1.454955 -0.225928
H  -1.779658 -0.326535 1.629738
H  -2.217597 -1.679092 0.521631
H  2.671676 1.389705 -0.041672
H  -2.924068 1.060159 0.00702
