program: Gaussian 09
title: 000191751
version: EM64L-G09RevD.01
frameworkgroup: C1[X(C18H17NO3)]
method: RPBEPBE
basis: SDD
operation: Freq
keyword: #p
keyword: freq=noraman
keyword: PBEPBE/SDD
title: #p freq=noraman PBEPBE/SDD
converged: YES YES NO NO
title: Mulliken charges:
elementType: O O O N C C C C C C C C C C C C C C C C C C H H H H H H H H H H H H H H H H H
charge: -0.241258 -0.261039 -0.283849 -0.258417 -0.269526 0.014415 -0.676466 0.149740 0.385629 -0.534740 0.404990 -0.474950 0.056494 -0.001833 -0.556953 0.175050 0.198980 -0.488734 -0.389270 -0.210544 -0.216250 -0.518636 0.247803 0.254834 0.221676 0.218551 0.217566 0.246778 0.230973 0.221799 0.258825 0.241834 0.252607 0.240439 0.228198 0.227397 0.214289 0.232945 0.240655
chargesum: 0.00000
title: Mulliken charges with hydrogens summed into heavy atoms:
elementType: O O O N C C C C C C C C C C C C C C C C C C
charge: -0.241258 -0.261039 -0.283849 -0.011639 -0.021724 0.014415 -0.199956 0.149740 0.385629 -0.098624 0.404990 -0.022178 0.056494 -0.001833 -0.298128 0.175050 0.198980 -0.246900 -0.136663 0.258092 0.011147 0.169252
polarizability: 2.64562667e+02 9.30230928e+00 2.43524422e+02 4.67601903e+00 9.16049507e+00 1.29645117e+02
1716.lowfreq: -6.6299 -0.0008 -0.0006 -0.0003 3.6514 7.8922 37.1148 63.9994 68.3991
frequency: 36.9978 63.9859 68.3927 89.3511 106.5757 116.8598 125.8498 156.7177 179.7730 203.2538 228.5126 250.5584 269.4398 285.3510 308.8263 341.0480 343.5392 358.6953 400.4260 419.1702 452.4803 475.2811 504.0530 510.7417 522.3363 530.2409 573.9686 592.1985 610.3259 649.4489 665.3972 683.4410 708.0532 716.3257 728.5183 743.6515 759.1077 794.4211 802.5450 834.9843 860.8735 875.2836 889.9253 894.7679 908.3898 926.2187 958.5516 971.4370 981.9276 984.4495 1021.4480 1023.5564 1062.0137 1073.5610 1075.4701 1093.3794 1108.6806 1128.7090 1131.6323 1142.1453 1151.8867 1162.2500 1169.4528 1179.2990 1197.4137 1211.2576 1222.6645 1234.2990 1248.1848 1267.6851 1297.1594 1302.2019 1321.5172 1328.1986 1353.6680 1358.1690 1367.3152 1396.2119 1413.6627 1428.0459 1429.8207 1444.7194 1454.8155 1456.7325 1458.5293 1460.2133 1462.5787 1465.8408 1471.7933 1481.1310 1573.4214 1601.4258 1604.0672 1623.3239 2937.3639 2952.6377 2954.6267 2968.1536 2987.2323 2991.2023 3011.3509 3051.6015 3057.9899 3062.6412 3117.3880 3117.8419 3126.7044 3147.0446 3161.2180 3170.1100 3396.0055
redmass: 1.6068 3.3386 3.0055 3.4821 4.6777 2.5703 2.2548 3.9953 3.9726 4.1368 3.4347 3.3793 4.5212 4.0644 3.9640 4.4767 3.5581 5.8754 5.7487 5.0471 4.2614 4.1620 4.1781 3.0771 5.8768 3.8314 3.9123 4.4474 3.9104 5.6715 2.1453 8.6745 5.1533 5.4487 2.8021 2.9935 3.4205 2.5500 2.3548 4.7669 1.7159 4.5075 2.0834 1.8083 2.9327 2.9497 3.4510 1.3789 2.6153 3.3284 3.6009 4.0340 3.0313 2.0346 1.5602 1.9062 1.2439 1.2701 2.5124 2.0488 1.4068 1.4796 1.2026 1.4659 1.3353 3.1402 1.5588 2.4337 2.1046 2.7663 1.8811 1.4616 1.8085 1.3933 1.3734 1.6935 2.4713 5.1848 4.0035 2.8308 1.6106 1.1590 1.2936 1.5312 1.1651 1.2569 1.1774 2.1111 1.1007 1.1673 6.8944 8.5082 7.2946 9.5572 1.0740 1.0753 1.0619 1.0333 1.0637 1.0678 1.0909 1.0930 1.1045 1.1010 1.1053 1.1027 1.0869 1.0927 1.0929 1.0978 1.0737
irintensity: 0.7765 0.7274 1.0627 1.6185 0.4567 14.2772 3.6673 1.6000 4.5867 1.3571 2.9015 3.5301 0.8700 0.3062 0.7521 5.6229 1.4062 4.1487 0.9289 4.1903 2.3859 6.3999 2.5887 18.5253 7.3612 0.3038 3.1744 3.5645 16.3737 2.0478 33.4739 2.3748 15.5318 25.6615 44.5264 47.9488 19.0953 13.2846 24.3989 29.7730 20.2253 14.2512 4.3921 13.2013 4.3657 2.4024 44.3788 6.7393 41.3065 67.9550 18.9670 37.9730 14.4961 5.8898 8.5380 9.8968 4.9023 0.2200 11.9630 4.1891 5.8991 4.7803 7.8971 5.2921 26.5618 88.3451 40.2526 57.0427 20.5108 59.3962 1.8950 22.1162 16.0763 6.6903 6.2402 6.0321 13.2602 59.6745 4.8282 57.8855 2.7708 17.4735 4.5963 24.8734 4.5037 6.1653 22.0267 50.9499 16.9560 2.6953 24.5603 23.7626 13.3446 9.0252 6.9183 40.0222 46.3040 69.8159 135.1737 31.1228 60.9667 22.5929 47.9749 31.0064 5.5129 42.0823 5.1098 20.8531 3.8064 18.6345 1.5689
temp: 298.150 k
press: 1.00000 atm
elementType: 8 8 8 7 6 6 6 6 6 6 6 6 6 6 6 6 6 6 6 6 6 6 1 1 1 1 1 1 1 1 1 1 1 1 1 1 1 1 1
symmnumber: 1
zpe: 814258.1 jmol-1
zpe.correction: 0.310135 hartree
zpe.thermalcorrener: 0.328133 hartree
zpe.thermalcorrenthalpy: 0.329077 hartree
zpe.thermalcorrgfe: 0.264594 hartree
zpe.sumelectzpe: -974.927684 hartree
zpe.sumelectthermal: -974.909686 hartree
zpe.sumelectthermalent: -974.908741 hartree
zpe.sumelectthermalfe: -974.973225 hartree
dipole: 1.6000 0.2070 -0.0120
dipole: 1.6134
quadrupole: -121.6211 -124.8966 -122.2985
quadrupole: 0.4432 -2.3715 2.6088
quadrupole: 1.3176 -1.9579 0.6403 0.4432 -2.3715 2.6088
hfenergy: -975.2378186 hartree
pointgroup: C01 [X(C18H17N1O3)]
dipole: -0.6345668 0.0131317 -0.0088455 debye
polarizability: 266.0093754|-6.5623843|241.5815507|8.5938997|-9.9197948|130.1412799 unknown
InChI: InChI=1S/C18H17NO3/c1-20-13-4-2-3-10-7-12-15-11(5-6-19-12)8-14-18(22-9-21-14)17(15)16(10)13/h2-4,8,12,19H,5-7,9H2,1H3
charge 0 multiplicity 1
39 atoms
O  0.736568 2.603981 0.533423
O  -1.4573 3.544781 0.426393
O  2.729933 1.385604 -0.988886
N  -2.202025 -2.89537 -0.115512
C  -0.95631 -2.108759 -0.272053
C  -1.161725 -0.586439 -0.19334
C  0.074461 -2.509037 0.804711
C  0.021043 0.219483 -0.001042
C  -2.460802 -0.023195 -0.247528
C  -3.691815 -0.899529 -0.478685
C  1.389909 -1.786357 0.56669
C  -3.307925 -2.331744 -0.926741
C  1.351825 -0.444969 0.057664
C  -0.211264 1.586673 0.236493
C  -2.643704 1.3805 -0.063537
C  -1.510306 2.142849 0.195713
C  2.595811 0.153073 -0.319549
C  2.619008 -2.426822 0.823069
C  3.824428 -0.484362 -0.022279
C  -0.079016 3.781652 0.921839
C  3.840399 -1.760176 0.570452
C  1.96895 1.5707 -2.234433
H  -0.526687 -2.363179 -1.264948
H  0.224798 -3.602916 0.781194
H  -0.339388 -2.250661 1.804343
H  -4.283865 -0.958286 0.458764
H  -4.352019 -0.423412 -1.231056
H  -2.469129 -2.9548 0.880177
H  -4.18194 -3.005548 -0.869432
H  -2.971425 -2.319502 -1.981184
H  -3.637998 1.834684 -0.103682
H  2.619244 -3.448643 1.218984
H  4.746883 0.033315 -0.302133
H  0.331269 4.678116 0.434561
H  -0.09778 3.856892 2.026867
H  4.795015 -2.250824 0.789204
H  2.205113 0.761765 -2.953454
H  2.309218 2.538053 -2.634072
H  0.878746 1.604605 -2.063592
