program: Gaussian 09
title: 000182313
version: EM64L-G09RevD.01
frameworkgroup: C1[X(C14H12O2)]
method: RPBEPBE
basis: SDD
operation: Freq
keyword: #pfreq=noraman
keyword: PBEPBE/SDD
title: #p freq=noraman PBEPBE/SDD
converged: YES YES NO NO
title: Mulliken charges:
elementType: O O C C C C C C C C C C C C C C H H H H H H H H H H H H
charge: -0.442666 -0.454027 -0.195244 0.199823 -0.243524 0.351869 -0.593634 0.396549 -0.250601 0.395188 -0.643349 -0.367792 -0.421386 -0.421736 -0.239275 -0.241046 0.252874 0.255515 0.285035 0.237146 0.244006 0.238178 0.247001 0.240764 0.357798 0.353062 0.229966 0.229507
chargesum: 0.00000
title: Mulliken charges with hydrogens summed into heavy atoms:
elementType: O O C C C C C C C C C C C C C C
charge: -0.084868 -0.100965 0.057630 0.199823 0.011990 0.351869 -0.308599 0.396549 -0.013455 0.395188 -0.399343 -0.129614 -0.174386 -0.180972 -0.009309 -0.011539
polarizability: 2.74332204e+02 -1.12986790e+01 1.54966067e+02 9.87484474e+00 -6.95177373e-01 7.82280930e+01
1716.lowfreq: -8.8062 -3.5528 -0.0007 -0.0006 -0.0003 14.5193 64.0159 82.3017 119.5135
frequency: 63.9920 82.2654 119.5035 175.3928 202.5820 233.9238 274.8670 297.3434 326.7995 354.0675 378.7980 400.8134 459.8041 471.3888 483.1470 490.6220 529.4064 558.5153 572.0126 613.7334 635.2621 653.5737 687.7885 743.1826 763.8714 768.9613 785.8289 801.7125 839.0283 863.8981 874.0949 896.7548 915.6115 946.8284 968.2242 973.2444 984.7182 992.7171 993.4236 1023.0145 1037.7517 1114.7766 1152.2716 1163.4849 1173.0892 1179.7084 1193.9997 1218.7839 1242.7020 1265.1778 1271.2412 1283.7178 1315.7226 1333.3348 1358.7178 1369.8122 1384.9418 1410.5631 1423.4044 1445.6840 1470.1012 1503.0075 1574.9422 1603.2373 1628.7246 1639.0741 2995.6503 3076.0945 3113.4165 3116.3120 3120.7993 3126.9864 3142.0079 3143.9156 3155.4062 3162.9677 3454.4915 3541.4709
redmass: 5.5782 4.3455 5.2631 6.0744 4.2981 5.1428 5.0128 4.2053 3.9600 1.1926 4.0758 3.3145 4.1853 5.2447 2.6789 4.2254 4.1419 1.2105 3.3186 6.2746 5.1069 4.0692 4.8688 2.5157 1.5272 3.8330 2.3831 1.9717 3.7388 1.6347 2.4084 5.0942 1.6090 1.6002 2.3883 1.8512 1.3578 1.7948 2.0694 2.2727 2.9055 1.9670 1.3882 1.5667 1.0763 1.2105 1.2449 1.3237 1.6675 2.2059 2.0296 1.6028 1.9813 1.5884 1.1431 1.2598 1.8166 5.3097 3.2704 2.9008 3.9911 3.8666 6.9252 6.2541 6.8217 7.1209 1.0831 1.0872 1.0904 1.0884 1.0862 1.0887 1.0917 1.0944 1.0975 1.1004 1.0645 1.0661
irintensity: 0.2819 0.9155 3.6345 3.1145 1.2512 6.5001 1.3978 0.9650 1.5620 59.6018 2.8532 1.3840 0.8017 0.2183 22.4090 3.1215 0.9415 154.7045 12.4043 0.1471 6.5746 7.6639 3.9501 13.1733 83.8327 21.6087 9.6420 17.7780 23.9894 27.3922 5.3651 2.4054 52.6852 5.3668 10.2599 41.7562 4.9970 14.3729 18.6375 5.6781 72.1140 14.9475 6.7240 1.4194 0.9130 54.2259 9.9112 24.2173 1.3481 0.3096 5.6393 10.1957 4.5512 5.7460 54.6870 46.5443 2.8474 3.7319 0.9910 1.6187 0.6500 7.7176 2.2548 4.4500 19.7079 2.4222 14.4394 31.3052 1.0878 15.6245 7.3899 0.3508 1.8396 28.5253 26.1367 38.4387 30.2219 10.5974
temp: 298.150 k
press: 1.00000 atm
elementType: 8 8 6 6 6 6 6 6 6 6 6 6 6 6 6 6 1 1 1 1 1 1 1 1 1 1 1 1
symmnumber: 1
zpe: 580836.1 jmol-1
zpe.correction: 0.221229 hartree
zpe.thermalcorrener: 0.233648 hartree
zpe.thermalcorrenthalpy: 0.234592 hartree
zpe.thermalcorrgfe: 0.182957 hartree
zpe.sumelectzpe: -690.012669 hartree
zpe.sumelectthermal: -690.000250 hartree
zpe.sumelectthermalent: -689.999305 hartree
zpe.sumelectthermalfe: -690.050940 hartree
dipole: 1.5215 2.7430 0.4764
dipole: 3.1727
quadrupole: -88.1693 -87.9099 -96.3383
quadrupole: -7.5532 3.0931 -1.0317
quadrupole: 2.6365 2.8960 -5.5325 -7.5532 3.0931 -1.0317
hfenergy: -690.2338975 hartree
pointgroup: C01 [X(C14H12O2)]
dipole: -0.5567455 1.0826627 -0.27561 debye
polarizability: 274.324235|8.2164362|154.0669233|14.3934082|-4.5520856|79.1352056 unknown
InChI: InChI=1S/C14H12O2/c15-13-6-5-11-7-9-3-1-2-4-10(9)8-12(11)14(13)16/h1-8,13-16H
charge 0 multiplicity 1
28 atoms
O  2.394188 -2.400578 0.547098
O  3.566013 -0.691305 -1.253986
C  2.257429 -0.97177 0.831399
C  0.883104 -0.419212 0.449318
C  3.419216 -0.198959 0.157121
C  0.748295 1.008464 0.248233
C  -0.236372 -1.240681 0.374104
C  -1.542685 -0.699335 0.121883
C  3.219898 1.298843 0.196022
C  -1.690035 0.734401 -0.041694
C  -0.522037 1.558989 0.025269
C  1.962469 1.839506 0.232023
C  -2.707065 -1.52951 0.041998
C  -2.996624 1.277711 -0.275483
C  -3.968818 -0.972285 -0.188099
C  -4.11461 0.44247 -0.347818
H  2.37927 -0.878989 1.928743
H  4.368461 -0.506748 0.623623
H  -0.107794 -2.318903 0.520882
H  4.107154 1.936867 0.124131
H  -0.627332 2.642164 -0.119511
H  1.832771 2.928905 0.19768
H  -2.594232 -2.612889 0.166933
H  -3.107101 2.361919 -0.39864
H  2.710111 -2.451439 -0.398336
H  2.929046 -0.185571 -1.823459
H  -4.852692 -1.616823 -0.246744
H  -5.108427 0.866756 -0.527791
