program: Gaussian 09
title: 000182312
version: EM64L-G09RevD.01
frameworkgroup: C1[X(C12H11Cl3N2O4S)]
method: RPBEPBE
basis: SDD
operation: Freq
keyword: #p
keyword: freq=noraman
keyword: PBEPBE/SDD
title: #p freq=noraman PBEPBE/SDD
converged: NO YES NO NO
title: Mulliken charges:
elementType: Cl Cl Cl S O O O O N N C C C C C C C C C C C C H H H H H H H H H H H
charge: -0.048681 -0.035361 -0.036875 1.020283 -0.516122 -0.487088 -0.236222 -0.182408 -0.449602 -0.349443 -0.460966 -0.512584 0.347879 0.202555 -0.318652 0.507420 -0.579096 -0.323367 -0.310400 -0.077354 -0.075461 -0.252667 0.292980 0.288933 0.271889 0.338880 0.243004 0.275051 0.266625 0.286326 0.310214 0.313176 0.287135
chargesum: 0.00000
title: Mulliken charges with hydrogens summed into heavy atoms:
elementType: Cl Cl Cl S O O O O N N C C C C C C C C C C C C
charge: -0.048681 -0.035361 -0.036875 1.020283 -0.516122 -0.487088 -0.236222 -0.182408 -0.449602 -0.349443 0.120947 0.098185 0.347879 0.202555 0.199402 0.507420 -0.026145 -0.013154 0.002776 -0.077354 -0.075461 0.034468
polarizability: 3.01081168e+02 -8.90381099e+00 2.35118214e+02 2.10900398e+01 2.19640794e+01 1.33573372e+02
1716.lowfreq: -6.7830 -2.6868 0.0017 0.0027 0.0030 6.1766 11.7355 15.3846 29.0506
frequency: 11.6531 15.2200 28.9809 30.5379 42.0810 59.7133 73.6634 84.0054 113.2196 128.9844 134.5518 143.1727 164.9999 176.8026 184.1724 197.3536 209.4663 224.8587 243.2226 250.0322 273.8363 291.9346 303.4831 331.6101 382.6127 387.8779 412.8915 439.7479 447.7581 479.2774 510.6272 536.2291 585.5218 588.7936 595.8736 615.2609 650.1099 669.6719 704.5801 731.3448 758.1191 770.0860 794.7022 835.1441 862.1563 862.8409 875.3521 879.9482 934.2201 970.1072 977.6256 982.3918 984.4562 1024.7597 1030.9856 1070.6132 1077.7561 1106.3388 1117.5982 1122.3721 1155.3721 1163.2600 1189.7470 1201.0003 1243.3389 1265.0245 1269.6770 1299.3809 1311.1175 1335.8720 1356.6152 1374.9438 1421.9531 1423.0082 1443.5625 1452.6537 1453.5984 1462.3526 1566.1862 1597.7115 1642.0597 1692.0360 2991.7115 3016.1141 3044.7566 3056.5257 3075.8161 3084.6901 3141.1113 3144.2775 3189.5143 3206.8047 3208.0256
redmass: 17.8967 12.1295 8.4671 7.9487 7.1102 7.7865 6.0086 6.2116 8.0617 11.2734 7.7898 14.6374 6.7506 4.4508 8.9230 4.6505 3.5031 3.7541 3.0605 8.5877 7.2298 10.9791 7.3256 5.8993 11.6649 8.5896 8.3784 6.2930 7.1826 9.7953 5.1809 3.8316 4.9703 5.2104 7.0059 3.8661 4.6200 2.8787 9.7247 7.8433 10.7538 10.6794 1.3108 7.6537 1.5099 1.7473 1.4053 1.4852 3.3539 6.9034 2.9330 4.2462 2.3139 5.2470 1.7260 4.6154 2.7506 1.5865 1.8782 1.2490 6.9218 1.0953 1.3150 4.2481 1.2144 1.2039 1.2115 1.9693 1.1273 3.5166 1.3612 10.3176 2.9508 1.1064 2.9026 1.0921 1.1361 1.0919 7.4220 7.1188 11.4003 12.6332 1.0639 1.0616 1.0564 1.0605 1.0945 1.1016 1.1118 1.1114 1.0941 1.0929 1.0940
irintensity: 0.1144 0.2873 1.7974 0.4752 3.4956 1.1818 2.3380 2.4712 3.5853 4.9958 5.8276 1.0476 2.7280 12.4866 2.7932 0.0931 4.3046 4.8944 8.7597 2.0669 3.8631 9.0314 8.9097 34.3492 42.9467 16.9389 8.2685 8.3267 1.0613 153.1490 0.1523 0.6335 4.9626 1.8067 17.3316 12.1320 9.5847 30.9622 11.9618 12.6295 72.1465 70.2078 15.5672 88.7770 45.2204 23.2010 2.5832 13.8804 53.5670 6.0070 29.8834 0.4501 4.1166 38.3378 13.2925 228.9255 46.7020 16.6418 2.4653 4.9090 64.9550 1.6963 7.9190 263.5900 7.9071 5.5278 0.9260 16.7007 16.0721 268.6648 10.0690 1.9038 79.1722 10.3921 175.2649 7.9793 7.1664 18.2311 93.7434 138.8206 468.8612 91.0793 8.6626 9.4363 4.4910 19.1358 6.0586 1.3028 4.5141 8.5479 2.3049 9.2168 5.9665
temp: 298.150 k
press: 1.00000 atm
elementType: 17 17 17 16 8 8 8 8 7 7 6 6 6 6 6 6 6 6 6 6 6 6 1 1 1 1 1 1 1 1 1 1 1
symmnumber: 1
zpe: 574046.8 jmol-1
zpe.correction: 0.218643 hartree
zpe.thermalcorrener: 0.241532 hartree
zpe.thermalcorrenthalpy: 0.242476 hartree
zpe.thermalcorrgfe: 0.161203 hartree
zpe.sumelectzpe: -2650.751583 hartree
zpe.sumelectthermal: -2650.728694 hartree
zpe.sumelectthermalent: -2650.727750 hartree
zpe.sumelectthermalfe: -2650.809023 hartree
dipole: 3.9605 -0.5016 -2.7709
dipole: 4.8595
quadrupole: -142.0117 -174.6404 -161.2976
quadrupole: -3.2337 -10.9671 3.9539
quadrupole: 17.3048 -15.3238 -1.9810 -3.2337 -10.9671 3.9539
hfenergy: -2650.9702259 hartree
pointgroup: C01 [X(C12H11Cl3N2O4S1)]
dipole: 1.5672282 -0.6361125 -0.891329 debye
polarizability: 301.9271992|5.7535245|228.9833899|19.4277075|-32.3114679|138.8621658 unknown
InChI: InChI=1S/C12H11Cl3N2O4S/c13-2-1-3-22(20,21)16-7-11(18)17(12(16)19)10-5-8(14)4-9(15)6-10/h4-6H,1-3,7H2
charge 0 multiplicity 1
33 atoms
Cl 4.708758 2.254859 -2.894335
Cl -3.635968 3.507419 -0.581614
Cl -5.883678 -1.557898 -0.872519
S  3.163068 -0.545463 0.994036
O  3.892917 -1.928053 1.42521
O  3.134128 0.700274 2.023638
O  0.639491 0.867501 -0.429988
O  -1.591136 -2.850355 1.485204
N  1.396096 -1.136819 0.581904
N  -0.858264 -0.827932 0.43092
C  0.81924 -2.28131 1.299106
C  3.755353 0.040169 -0.755892
C  0.430527 -0.22845 0.139382
C  -0.69301 -2.067693 1.110177
C  5.14919 0.654625 -0.602965
C  -2.117095 -0.241668 0.051089
C  5.765778 0.99318 -1.965435
C  -3.230882 -1.084867 -0.196687
C  -2.233417 1.167522 -0.059853
C  -3.47813 1.702659 -0.431009
C  -4.449717 -0.485793 -0.555605
C  -4.61145 0.906842 -0.685351
H  1.06506 -2.286147 2.377473
H  1.133517 -3.24622 0.868679
H  3.72465 -0.893522 -1.34042
H  2.97082 0.749444 -1.064691
H  5.833427 -0.062456 -0.104733
H  5.096559 1.561585 0.02451
H  5.834258 0.120514 -2.632628
H  6.751614 1.465731 -1.847833
H  -3.153473 -2.167095 -0.090256
H  -1.377093 1.818973 0.116706
H  -5.569637 1.348242 -0.96772
