program: Gaussian 09
title: 000182311
version: EM64L-G09RevD.01
frameworkgroup: C1[X(C12H10Cl2N2O4S)]
method: RPBEPBE
basis: SDD
operation: Freq
keyword: #p
keyword: freq=noraman
keyword: PBEPBE/SDD
title: #p freq=noraman PBEPBE/SDD
converged: YES YES NO NO
title: Mulliken charges:
elementType: Cl Cl S O O O O N N C C C C C C C C C C C C H H H H H H H H H H
charge: -0.038800 -0.038241 1.032374 -0.491532 -0.514181 -0.255510 -0.185759 -0.450682 -0.350071 -0.463030 0.348353 0.203058 -0.623772 0.502850 -0.322858 -0.310710 0.014030 -0.076630 -0.075994 -0.255128 -0.489224 0.287890 0.290989 0.342150 0.274136 0.311833 0.313908 0.260617 0.286697 0.240390 0.232848
chargesum: 0.00000
title: Mulliken charges with hydrogens summed into heavy atoms:
elementType: Cl Cl S O O O O N N C C C C C C C C C C C C
charge: -0.038800 -0.038241 1.032374 -0.491532 -0.514181 -0.255510 -0.185759 -0.450682 -0.350071 0.115849 0.348353 0.203058 -0.007486 0.502850 -0.011025 0.003197 0.274647 -0.076630 -0.075994 0.031569 -0.015986
polarizability: 3.31384959e+02 2.02887072e+01 2.27118100e+02 9.20210966e+00 -3.51749537e+00 1.21458577e+02
1716.lowfreq: -4.7161 -3.8793 -2.2991 -0.0028 -0.0016 -0.0012 12.1809 26.5593 28.9633
frequency: 12.1001 26.5395 28.9512 45.6857 58.6087 72.4452 82.7332 111.3251 129.2160 138.1717 140.8086 163.1278 167.3105 180.1153 196.8133 202.7431 210.6709 248.7303 266.3890 293.2795 302.4032 317.8093 383.9193 398.1649 412.5804 415.6218 440.3835 448.1499 469.4306 510.4407 536.8131 586.5518 591.6424 647.8254 668.2804 673.5676 705.2853 731.6960 757.1565 767.8725 836.5343 860.8838 872.8275 876.3764 881.0900 947.2841 966.8258 971.0260 982.0721 984.0428 984.7040 1005.4861 1025.3670 1066.2387 1093.2565 1105.7346 1117.3528 1156.3865 1160.0328 1195.3016 1205.6700 1213.3638 1269.0495 1299.7980 1300.5539 1337.5395 1373.7599 1415.5511 1421.2159 1443.9020 1446.6191 1453.1102 1564.9196 1597.6600 1629.4571 1638.0184 1688.3114 3015.2951 3038.5097 3082.4589 3101.5226 3138.3852 3153.8185 3189.7370 3207.9116 3209.1774 3215.4810
redmass: 9.7557 8.8723 5.1908 6.9004 5.1531 6.0315 5.6142 4.7419 11.0023 8.1943 6.8686 5.6478 5.9976 7.6670 4.6814 5.6284 4.6459 9.0910 9.0326 10.8464 7.2431 3.4601 12.5527 4.5275 6.2815 2.8296 4.9723 8.0532 8.7409 5.2007 3.8146 4.8060 7.3825 4.6231 2.3703 1.9545 9.6742 7.9682 10.7542 10.7504 12.8593 1.4871 1.5658 1.4256 1.4763 2.1151 3.7509 5.8767 5.0779 1.4652 1.7437 1.2639 5.4746 4.8873 1.4345 1.5883 1.8845 6.0991 1.1299 1.6510 2.3504 1.4838 1.2126 1.9979 1.2720 3.5087 10.1565 1.1375 2.9786 2.8075 1.2165 1.1525 7.3971 7.1271 4.1294 10.3406 12.6141 1.0613 1.0585 1.1016 1.0612 1.1009 1.1059 1.0941 1.0928 1.0939 1.1152
irintensity: 0.6958 1.5428 0.2501 0.7948 0.3861 0.7264 3.2362 1.9767 5.5877 1.6112 6.2792 8.4745 4.2627 4.9000 0.1348 23.4456 2.9235 3.2255 12.3878 11.6387 10.9900 10.4789 27.2984 51.6636 24.8901 57.3244 1.7818 7.4750 66.8332 0.1350 0.7555 5.0457 12.9520 10.6007 62.6247 21.1184 9.4276 14.3561 72.7571 82.6573 93.4230 40.0275 12.8698 5.1707 15.5640 32.2330 28.0889 27.1709 2.2260 44.0984 36.9133 4.9153 32.6092 283.1197 16.2756 12.5305 2.2108 86.9800 8.6075 5.2433 187.1384 52.7691 1.3350 22.1069 1.6531 300.1956 2.7353 28.9325 80.6739 199.2744 14.8540 4.7152 93.3107 156.6021 47.8121 420.4791 125.6755 10.8488 6.1852 1.3726 2.8029 1.9412 13.0372 2.2935 9.7000 6.9858 10.6949
temp: 298.150 k
press: 1.00000 atm
elementType: 17 17 16 8 8 8 8 7 7 6 6 6 6 6 6 6 6 6 6 6 6 1 1 1 1 1 1 1 1 1 1
symmnumber: 1
zpe: 534018.8 jmol-1
zpe.correction: 0.203397 hartree
zpe.thermalcorrener: 0.224986 hartree
zpe.thermalcorrenthalpy: 0.225931 hartree
zpe.thermalcorrgfe: 0.149049 hartree
zpe.sumelectzpe: -2190.163894 hartree
zpe.sumelectthermal: -2190.142304 hartree
zpe.sumelectthermalent: -2190.141360 hartree
zpe.sumelectthermalfe: -2190.218241 hartree
dipole: 3.5305 1.2753 3.6762
dipole: 5.2541
quadrupole: -134.1717 -151.8522 -145.2092
quadrupole: 7.4778 17.0818 -0.1388
quadrupole: 9.5727 -8.1078 -1.4648 7.4778 17.0818 -0.1388
hfenergy: -2190.3672907 hartree
pointgroup: C01 [X(C12H10Cl2N2O4S1)]
dipole: -1.4140009 -0.1169755 -1.5032911 debye
polarizability: 332.5820481|-13.1537231|213.7235837|13.4356195|-33.9748857|133.6560036 unknown
InChI: InChI=1S/C12H10Cl2N2O4S/c1-2-3-21(19,20)15-7-11(17)16(12(15)18)10-5-8(13)4-9(14)6-10/h2,4-6H,1,3,7H2
charge 0 multiplicity 1
31 atoms
Cl 3.600498 3.386132 -0.831263
Cl 5.677232 -1.738989 -0.370178
S  -3.487227 -0.284049 0.559667
O  -3.522007 1.003472 1.536772
O  -4.283382 -1.631119 0.980419
O  -0.765255 0.922911 -0.735593
O  1.151472 -2.672676 1.689124
N  -1.680844 -0.942633 0.399851
N  0.58924 -0.731157 0.402931
C  -1.210782 -2.041047 1.250837
C  -0.652154 -0.120517 -0.046269
C  0.319428 -1.897262 1.172262
C  -3.828932 0.254756 -1.379428
C  1.896035 -0.226227 0.074751
C  2.995937 -1.121543 0.017766
C  2.074579 1.158349 -0.178511
C  -5.070196 1.05525 -1.436167
C  3.364428 1.614004 -0.497271
C  4.261487 -0.599709 -0.297534
C  4.485165 0.76454 -0.564602
C  -6.257533 0.548432 -1.873041
H  -1.529454 -3.028018 0.87695
H  -1.541185 -1.945733 2.302004
H  -2.885938 0.793777 -1.566543
H  -3.868746 -0.740166 -1.847815
H  2.870454 -2.182514 0.234831
H  1.23071 1.847883 -0.148533
H  -4.998558 2.101286 -1.115498
H  5.47905 1.144719 -0.809882
H  -7.154252 1.174261 -1.931076
H  -6.359174 -0.497213 -2.188162
