program: Gaussian 09
title: 000191683
version: EM64L-G09RevD.01
frameworkgroup: C1[X(C8H12N3O5S)]
method: RPBEPBE
basis: SDD
operation: Freq
keyword: #p
keyword: freq=noraman
keyword: PBEPBE/SDD
title: #p freq=noraman PBEPBE/SDD
converged: YES YES NO NO
title: Mulliken charges:
elementType: S O O O O O N N N C C C C C C C C H H H H H H H H H H H H
charge: 0.010528 -0.249047 -0.398254 -0.197420 -0.343753 -0.300205 -0.321445 0.049873 0.117648 -0.130820 -0.752523 0.208412 0.378281 -0.112348 0.366846 -0.234758 -0.651484 0.327688 0.319313 0.329524 0.341011 0.259931 0.261073 0.145283 0.246620 0.243555 0.242619 0.416567 0.427286
chargesum: 1.00000
title: Mulliken charges with hydrogens summed into heavy atoms:
elementType: S O O O O O N N N C C C C C C C C
charge: 0.155811 -0.249047 0.018313 -0.197420 0.083532 -0.300205 0.019566 0.049873 0.117648 0.196867 -0.103685 0.208412 0.378281 -0.112348 0.366846 0.286246 0.081310
polarizability: 1.95944204e+02 -2.00749276e+00 1.55600130e+02 -4.78869222e+00 1.47575996e+01 9.75197816e+01
1716.lowfreq: -15.1940 -4.1028 0.0015 0.0018 0.0020 6.1425 11.1632 30.4047 42.5855
frequency: -8.9121 29.9022 42.5669 51.2489 58.4433 71.4741 84.0967 96.0732 126.2393 148.4565 155.3146 196.0123 220.8669 238.3220 261.6665 281.0925 290.3669 333.3669 342.2442 369.1717 408.4072 436.8125 497.6692 512.1454 520.9356 537.2115 563.8826 613.1585 636.2094 646.4243 689.8922 708.2351 728.7701 760.8098 774.0934 777.2032 796.1924 817.3766 855.6300 972.9829 991.5490 1022.4161 1029.7491 1041.1443 1068.8590 1115.0715 1129.9030 1132.7070 1191.8914 1220.0087 1226.7605 1251.9158 1268.4799 1292.5322 1300.8871 1302.7411 1334.4830 1368.6218 1406.6379 1410.1572 1438.3491 1462.6506 1465.2498 1477.0927 1481.0331 1554.9452 1658.3264 1671.1592 2071.2088 2389.4804 2440.4467 3006.5168 3035.0829 3045.2252 3069.5790 3101.3899 3101.9526 3128.2219 3152.8342 3267.0026 3521.2179
redmass: 2.5733 7.2790 6.2953 8.7529 6.7231 6.2807 6.1639 6.8251 3.0187 9.6567 9.4056 5.5372 2.8906 1.8566 2.5583 5.0738 4.3844 2.0207 1.8335 6.6886 4.5285 4.5148 4.6787 7.9452 12.0589 7.2960 4.6086 2.2329 6.4562 2.0746 4.6453 5.9908 8.2092 1.6474 2.0745 1.7803 1.1062 2.7694 3.8519 2.4869 1.9870 2.1333 1.0880 2.9957 2.9395 2.3113 1.4703 3.1871 2.1485 1.2289 1.7402 1.1402 1.5004 3.3799 1.2731 2.8747 1.8661 1.7511 1.3213 1.5336 1.0850 1.0385 1.0935 1.6923 1.3354 5.3873 4.2328 8.8593 13.9004 1.0858 1.0384 1.0368 1.0581 1.0829 1.0615 1.1028 1.1021 1.1060 1.1067 1.0802 1.0649
irintensity: 0.0183 0.0474 2.3706 1.8617 2.1096 1.0605 0.9942 0.8214 1.9405 1.3455 1.9594 0.1714 5.6825 2.0667 6.2899 2.8466 11.9891 40.0049 0.2895 33.8616 38.8922 7.3199 95.8733 14.7319 0.4068 1.2531 27.4240 76.6414 4.6959 44.4283 35.6691 9.0467 17.0487 2.9147 56.0611 54.3383 3.9985 7.5275 22.8399 25.9437 116.6510 47.9474 190.3895 85.7106 177.9106 1.4083 12.0377 73.5010 239.6139 11.4695 17.2681 0.9122 23.6768 64.1146 11.2993 431.9687 32.8245 87.6405 169.7564 129.3729 24.5316 18.4788 1.2669 113.3656 115.1910 626.5105 344.8917 371.9391 230.1899 984.7488 7.7062 3.1576 5.5799 2.5030 1.4874 3.8857 4.6195 22.4637 0.8055 453.7432 86.8338
temp: 298.150 k
press: 1.00000 atm
elementType: 16 8 8 8 8 8 7 7 7 6 6 6 6 6 6 6 6 1 1 1 1 1 1 1 1 1 1 1 1
symmnumber: 1
zpe: 546074.0 jmol-1
zpe.correction: 0.207989 hartree
zpe.thermalcorrener: 0.225793 hartree
zpe.thermalcorrenthalpy: 0.226737 hartree
zpe.thermalcorrgfe: 0.160355 hartree
zpe.sumelectzpe: -1248.918793 hartree
zpe.sumelectthermal: -1248.900989 hartree
zpe.sumelectthermalent: -1248.900045 hartree
zpe.sumelectthermalfe: -1248.966427 hartree
dipole: -1.6704 0.0976 -0.7468
dipole: 1.8323
quadrupole: -31.5802 -99.8723 -100.0369
quadrupole: -7.1827 1.9088 -0.9716
quadrupole: 45.5830 -22.7092 -22.8738 -7.1827 1.9088 -0.9716
hfenergy: -1249.126782 hartree
pointgroup: C01 [X(C8H12N3O5S1)]
dipole: -0.6767487 0.2203325 0.1146262 debye
polarizability: 194.8378217|10.4802339|121.1835342|6.2357869|-31.3056998|133.0427595 unknown
InChI: InChI=1S/C8H12N3O5S/c1-2-16-8(15)5(11-9)6(12)10-4(3-17)7(13)14/h4,10,12-13,17H,2-3H2,1H3
charge 1 multiplicity 1
29 atoms
S  3.495114 -0.704347 2.389815
O  -3.550456 -0.277485 0.150363
O  4.182188 0.550917 -1.433871
O  2.306081 -0.837982 -1.504923
O  0.04355 1.51418 -0.927069
O  -2.395603 1.206353 -1.235799
N  1.212085 0.40974 0.707924
N  -1.274319 -0.882714 1.459108
N  -1.386491 -1.67308 2.314221
C  2.505339 0.930678 0.231224
C  3.534411 0.908566 1.392175
C  2.954748 0.092842 -0.993471
C  0.051853 0.643023 0.084403
C  -1.213372 0.016323 0.469288
C  -2.448892 0.36195 -0.276473
C  -4.876499 0.009607 -0.566654
C  -5.938435 -0.807695 0.146355
H  2.381284 1.970993 -0.12027
H  3.296533 1.688606 2.131788
H  4.546163 1.0783 1.000023
H  1.321559 -0.311165 1.448958
H  -5.038511 1.098908 -0.50195
H  -4.728777 -0.281293 -1.62052
H  4.12384 -1.507114 1.450951
H  -6.910898 -0.627974 -0.346525
H  -5.7249 -1.88767 0.09043
H  -6.035215 -0.513077 1.204158
H  4.488649 0.064972 -2.247343
H  -0.947632 1.604536 -1.312517
