program: Gaussian 09
title: 000182303
version: EM64L-G09RevD.01
frameworkgroup: C1[X(C10H8Cl2N2O4S)]
method: RPBEPBE
basis: SDD
operation: Freq
keyword: #p
keyword: freq=noraman
keyword: PBEPBE/SDD
title: #p freq=noraman PBEPBE/SDD
converged: YES YES NO NO
title: Mulliken charges:
elementType: Cl Cl S O O O O N N C C C C C C C C C C H H H H H H H H
charge: -0.035516 -0.035581 1.052118 -0.243184 -0.479662 -0.510103 -0.180917 -0.457067 -0.349693 -0.461547 0.345892 0.202958 0.509472 -0.708266 -0.323188 -0.311826 -0.076230 -0.075738 -0.251026 0.290370 0.293418 0.281889 0.289657 0.325490 0.309367 0.311582 0.287329
chargesum: 0.00000
title: Mulliken charges with hydrogens summed into heavy atoms:
elementType: Cl Cl S O O O O N N C C C C C C C C C C
charge: -0.035516 -0.035581 1.052118 -0.243184 -0.479662 -0.510103 -0.180917 -0.457067 -0.349693 0.122241 0.345892 0.202958 0.509472 0.188770 -0.013822 -0.000243 -0.076230 -0.075738 0.036303
polarizability: 2.66370807e+02 5.85654869e+00 2.05638801e+02 -1.05022135e+00 1.51579024e-01 9.96399252e+01
1716.lowfreq: -0.0029 -0.0017 -0.0012 3.9524 4.9207 6.2334 18.6670 28.7897 51.5479
frequency: 18.3970 28.7801 51.5396 63.4641 80.8506 125.4812 130.9413 145.0164 163.3239 171.1214 179.8796 187.3082 197.7023 208.6236 229.7704 250.9977 277.3392 292.3354 304.0214 344.1473 375.7589 384.6705 413.1201 444.6170 450.6125 511.1173 536.3402 570.1328 586.8192 594.8145 649.5746 669.9267 705.4896 731.3322 758.5456 770.0640 832.2731 862.1089 875.1399 879.9564 919.8387 970.5787 982.5644 984.1685 997.3227 1025.8232 1045.5623 1074.4910 1106.5500 1116.9864 1157.2475 1162.8713 1201.8476 1268.2143 1299.2145 1310.8408 1336.5061 1374.9591 1408.8260 1421.7648 1424.0892 1444.0394 1453.4166 1566.3553 1597.9414 1642.3697 1692.8988 3015.7472 3024.8905 3085.6436 3178.2066 3188.8712 3189.1652 3206.5863 3208.0001
redmass: 10.0050 11.4645 7.8135 10.2721 6.5683 9.5291 8.9636 17.9602 5.7694 2.5182 1.2188 8.5888 4.6468 5.2978 4.1986 9.4719 6.9469 10.2368 7.3889 8.5441 11.7858 12.4878 8.5015 5.4760 8.7397 5.1682 3.8673 8.4592 4.7174 8.1426 4.6196 2.8878 9.7937 7.7316 10.7502 10.7883 11.9708 1.5086 1.4107 1.4748 2.8750 7.4835 5.0265 2.1136 1.3429 5.0631 2.0380 4.6936 1.6068 1.8585 7.3164 1.0988 4.8003 1.2103 1.8910 1.1647 3.5344 10.3002 1.0539 2.9021 1.0657 2.8881 1.1451 7.4411 7.1535 11.1486 12.5562 1.0618 1.0239 1.1013 1.1091 1.1082 1.0941 1.0930 1.0938
irintensity: 0.8537 1.4389 2.4482 0.6864 3.8260 5.4077 6.2678 0.4658 3.1569 1.6395 0.2822 1.0026 0.1269 0.1635 4.9991 0.7358 3.2810 7.3036 6.4861 55.7218 129.9401 3.7001 6.7114 2.6719 10.0626 0.0867 1.5457 54.5629 2.6767 10.3595 10.6461 31.7133 11.7741 13.5752 74.5481 65.9656 82.5571 42.9069 3.3544 13.2799 28.9854 4.2230 2.0754 7.1287 84.6535 51.4939 79.2599 197.0544 13.7608 2.0817 58.8407 2.4017 253.5934 0.6425 14.1898 9.9866 260.6583 1.7384 18.6655 84.7658 13.6947 172.6013 5.5052 95.8243 135.1894 471.9293 90.1156 8.2828 2.7758 1.1595 4.2178 1.4153 2.2254 8.2112 5.6836
temp: 298.150 k
press: 1.00000 atm
elementType: 17 17 16 8 8 8 8 7 7 6 6 6 6 6 6 6 6 6 6 1 1 1 1 1 1 1 1
symmnumber: 1
zpe: 449424.2 jmol-1
zpe.correction: 0.171177 hartree
zpe.thermalcorrener: 0.190203 hartree
zpe.thermalcorrenthalpy: 0.191147 hartree
zpe.thermalcorrgfe: 0.121586 hartree
zpe.sumelectzpe: -2112.910999 hartree
zpe.sumelectthermal: -2112.891973 hartree
zpe.sumelectthermalent: -2112.891028 hartree
zpe.sumelectthermalfe: -2112.960589 hartree
dipole: 1.6701 0.2885 3.4723
dipole: 3.8639
quadrupole: -136.1874 -141.3356 -130.4287
quadrupole: 1.5831 15.0327 1.6638
quadrupole: -0.2035 -5.3517 5.5552 1.5831 15.0327 1.6638
hfenergy: -2113.0821753 hartree
pointgroup: C01 [X(C10H8Cl2N2O4S1)]
dipole: -0.6429197 -0.1300033 -1.37136 debye
polarizability: 266.6528308|-3.9082285|202.4816352|1.6969556|-17.1973332|102.5150669 unknown
InChI: InChI=1S/C10H8Cl2N2O4S/c1-19(17,18)13-5-9(15)14(10(13)16)8-3-6(11)2-7(12)4-8/h2-4H,5H2,1H3
charge 0 multiplicity 1
27 atoms
Cl 3.370684 3.31422 -0.155358
Cl 4.985876 -1.993428 -0.182106
S  -4.064145 0.129423 -0.108181
O  -1.142355 1.224283 -0.962665
O  -4.086784 1.359222 0.93958
O  -5.015645 -1.160464 0.119184
O  0.187841 -2.731172 1.283629
N  -2.325372 -0.670932 -0.169843
N  -0.067693 -0.639491 0.1454
C  -2.048905 -1.871729 0.629133
C  -1.189177 0.11199 -0.386815
C  -0.515082 -1.846843 0.752112
C  1.30325 -0.215041 0.03751
C  -4.166681 0.783887 -1.8929
C  2.330738 -1.191732 -0.018269
C  1.611989 1.168744 0.000496
C  2.962116 1.54377 -0.101946
C  3.661255 -0.750773 -0.111802
C  4.015562 0.611209 -0.15832
H  -2.385961 -2.794196 0.12898
H  -2.504545 -1.83707 1.636493
H  -4.104963 -0.104058 -2.535686
H  -5.136837 1.296658 -1.959317
H  -3.302254 1.454742 -1.997738
H  2.100258 -2.256143 0.032952
H  0.82404 1.92193 0.030274
H  5.057587 0.929393 -0.232801
