program: Gaussian 09
title: 000182301
version: EM64L-G09RevD.01
frameworkgroup: C1[X(C22H12O2)]
method: RPBEPBE
basis: SDD
operation: Freq
keyword: #pfreq=noraman
keyword: PBEPBE/SDD
title: #p freq=noraman PBEPBE/SDD
converged: YES YES NO NO
title: Mulliken charges:
elementType: O O C C C C C C C C C C C C C C C C C C C C C C H H H H H H H H H H H H
charge: -0.231693 -0.195575 0.134517 0.289606 0.268997 0.305950 0.194192 -0.168710 -0.270673 0.422140 0.395732 -0.598248 0.398129 -0.593391 -0.434717 -0.473350 -0.361107 -0.434165 -0.417132 -0.414477 -0.248914 -0.240641 -0.233153 -0.232713 0.296334 0.294218 0.295150 0.247534 0.317633 0.245409 0.252974 0.252706 0.233024 0.233546 0.235397 0.235474
chargesum: 0.00000
title: Mulliken charges with hydrogens summed into heavy atoms:
elementType: O O C C C C C C C C C C C C C C C C C C C C C C
charge: -0.231693 -0.195575 0.134517 0.289606 0.268997 0.305950 0.194192 -0.168710 -0.270673 0.422140 0.395732 -0.301914 0.398129 -0.299173 -0.139568 -0.225816 -0.043474 -0.188756 -0.164158 -0.161771 -0.015890 -0.007096 0.002244 0.002761
polarizability: 5.13951295e+02 -2.60231070e+00 2.72389583e+02 -7.25614025e-03 -5.28593145e-03 8.81252647e+01
1716.lowfreq: -0.7375 -0.0008 -0.0003 0.0006 6.1090 12.3317 26.5933 53.8496 83.8418
frequency: 26.5625 53.8213 83.8382 98.8167 109.2373 120.1963 204.3683 221.8790 223.6207 237.4170 266.2212 294.0616 333.8821 352.0745 376.3005 395.6194 409.7486 445.5845 458.8594 475.3395 480.3998 509.3942 519.8296 528.3081 540.1614 579.8633 603.9022 609.4594 638.3947 654.8119 677.4504 700.9407 736.5352 752.2241 767.1568 768.1393 779.3673 785.9498 791.4269 836.0264 851.8577 860.1160 875.0825 901.4375 907.7949 917.2236 948.1114 974.6856 983.4845 984.2089 994.4166 1000.6881 1015.5195 1019.6283 1021.5191 1030.5878 1041.6241 1111.5149 1145.8026 1151.7260 1168.4285 1175.8023 1177.3554 1203.1096 1227.6882 1239.7197 1242.6660 1271.3426 1274.8244 1303.9261 1330.5799 1350.4802 1401.9058 1407.5932 1415.4277 1423.5429 1431.9690 1441.8040 1451.8781 1458.7139 1503.6110 1507.7591 1526.5018 1540.4057 1562.9178 1584.4393 1596.5938 1604.2984 1622.5874 1634.5662 3125.0380 3128.4996 3131.1681 3134.2918 3139.2026 3143.1090 3147.6409 3149.5402 3160.4755 3166.8877 3168.0434 3198.6289
redmass: 7.7132 4.7042 5.8269 7.3417 4.9930 5.7597 4.4970 6.3581 6.0992 4.2529 6.9699 5.3423 9.4765 5.4392 10.6912 3.4663 3.5037 6.4863 9.6259 4.4121 2.6243 3.8689 7.6432 3.4507 6.9262 7.0991 4.0457 7.0677 6.8344 6.7575 4.5523 7.1221 2.2800 6.1682 1.2439 5.2013 3.0248 2.0646 2.7990 6.1757 1.5923 5.7174 1.4034 2.6511 1.6690 5.5268 1.4040 1.7783 1.4248 1.4725 4.3809 1.3808 1.4008 1.3214 2.3611 3.9148 2.3523 2.4394 1.5908 1.6010 1.4582 1.0903 1.1319 1.7958 1.5368 2.7480 1.9191 1.9168 1.7288 4.3141 2.7903 3.3447 3.6776 5.6682 6.9086 2.9392 3.6257 2.8364 2.5057 3.7366 4.7750 3.8031 7.3009 8.5519 7.5545 8.5830 6.2926 6.3131 6.3885 7.1952 1.0868 1.0859 1.0896 1.0893 1.0913 1.0917 1.0917 1.0953 1.0988 1.1005 1.0954 1.0943
irintensity: 3.9356 0.1868 0.0484 1.2950 1.1751 0.8276 1.2338 0.0108 2.9309 0.0789 0.1519 0.7281 4.4386 0.2057 12.6699 0.7531 0.5614 9.3786 0.2976 1.1350 25.3857 4.6388 6.3944 9.2191 18.2347 8.7766 0.3220 1.4359 4.7388 1.3518 1.5347 3.8226 10.4482 4.2801 8.4807 2.4325 12.3765 106.7014 12.9017 5.8166 28.3764 8.1040 6.0619 1.8413 11.4999 0.4333 24.0064 0.0701 2.6889 29.7747 42.7754 0.0022 0.2234 2.2395 2.0561 4.3318 54.6749 6.6287 0.9754 10.2563 32.1359 2.5301 18.6315 189.1114 32.5534 6.7340 20.1743 4.4289 22.7795 456.7113 119.2507 12.5993 0.8746 44.6453 7.8715 31.5585 6.2880 27.4979 65.7146 120.0890 32.0677 51.7289 37.7658 143.0814 10.2767 10.5094 25.1172 8.1531 1.4743 1.3177 0.4308 0.8990 9.3411 0.1827 21.7681 0.2658 2.1165 20.2994 39.8891 47.7520 8.3069 30.6421
temp: 298.150 k
press: 1.00000 atm
elementType: 8 8 6 6 6 6 6 6 6 6 6 6 6 6 6 6 6 6 6 6 6 6 6 6 1 1 1 1 1 1 1 1 1 1 1 1
symmnumber: 1
zpe: 706150.7 jmol-1
zpe.correction: 0.268959 hartree
zpe.thermalcorrener: 0.285691 hartree
zpe.thermalcorrenthalpy: 0.286635 hartree
zpe.thermalcorrgfe: 0.224298 hartree
zpe.sumelectzpe: -994.462833 hartree
zpe.sumelectthermal: -994.446101 hartree
zpe.sumelectthermalent: -994.445157 hartree
zpe.sumelectthermalfe: -994.507494 hartree
dipole: -0.6178 -0.7745 0.0018
dipole: 0.9907
quadrupole: -91.1693 -137.2952 -143.2710
quadrupole: 4.8481 0.0004 -0.0178
quadrupole: 32.7425 -13.3834 -19.3592 4.8481 0.0004 -0.0178
hfenergy: -994.7317916 hartree
pointgroup: C01[X(C22H12O2)]
dipole: -0.243814 0.3041041 0.0013938 debye
polarizability: 513.9361105|3.2117124|272.3977306|-0.4837763|1.0896274|88.1323013 unknown
InChI: InChI=1S/C22H12O2/c23-21-17-10-9-13-5-3-4-8-16(13)20(17)22(24)19-12-15-7-2-1-6-14(15)11-18(19)21/h1-12H
charge 0 multiplicity 1
36 atoms
O  0.575064 2.291516 -0.04014
O  -0.324584 -3.152021 -0.074764
C  1.55789 0.052976 -0.056691
C  -0.98538 0.484146 -0.050697
C  1.271765 -1.34103 -0.064333
C  -1.252718 -0.929686 -0.059754
C  2.949252 0.488768 -0.056236
C  0.413531 1.025259 -0.048685
C  -0.123682 -1.893474 -0.066749
C  3.99747 -0.520511 -0.062758
C  -3.410713 0.933046 -0.045329
C  -2.055711 1.386452 -0.04357
C  -3.676546 -0.494903 -0.05472
C  -2.571354 -1.39906 -0.061718
C  2.322107 -2.310393 -0.070544
C  3.651163 -1.910535 -0.069532
C  3.361279 1.867108 -0.050005
C  5.375661 -0.129604 -0.062607
C  -4.516037 1.845877 -0.038139
C  -5.035379 -0.951737 -0.056586
C  4.715536 2.216433 -0.050282
C  5.736389 1.217839 -0.05649
C  -5.830381 1.370942 -0.040124
C  -6.092029 -0.037305 -0.049427
H  -1.829195 2.45819 -0.036643
H  -2.736566 -2.482345 -0.068738
H  2.032613 -3.36507 -0.076159
H  4.456411 -2.654431 -0.073958
H  2.591479 2.638718 -0.044834
H  6.142523 -0.913047 -0.067535
H  -4.314296 2.923149 -0.03102
H  -5.232508 -2.029882 -0.063705
H  4.996214 3.275501 -0.045635
H  6.791654 1.511579 -0.056468
H  -6.669553 2.074763 -0.03456
H  -7.12787 -0.393129 -0.050865
