program: Gaussian 09
title: 000182298
version: EM64L-G09RevD.01
frameworkgroup: C1[X(C12H19NO)]
method: RPBEPBE
basis: SDD
operation: Freq
keyword: #p
keyword: freq=noraman
keyword: PBEPBE/SDD
title: #p freq=noraman PBEPBE/SDD
converged: YES YES NO NO
title: Mulliken charges:
elementType: O N C C C C C C C C C C C C H H H H H H H H H H H H H H H H H H H
charge: -0.442369 -0.467268 -0.053062 0.066585 0.392649 0.354035 -0.583103 -0.347539 -0.734204 -0.427119 -0.415720 -0.258029 -0.825570 -0.673785 0.224196 0.293598 0.225881 0.207448 0.206717 0.206480 0.227591 0.229030 0.220940 0.230103 0.227560 0.223712 0.227674 0.237473 0.218495 0.212514 0.220570 0.231212 0.343304
chargesum: 0.00000
title: Mulliken charges with hydrogens summed into heavy atoms:
elementType: O N C C C C C C C C C C C C
charge: -0.099065 -0.173669 0.171134 0.066585 0.392649 0.354035 -0.149774 0.065658 -0.056643 -0.197015 -0.188160 -0.034317 -0.141928 -0.009489
polarizability: 1.74746618e+02 3.65025682e+00 1.54118957e+02 -2.94830519e+00 2.85964871e+00 9.57206541e+01
1716.lowfreq: -14.0085 -5.6350 -0.0009 -0.0006 -0.0005 8.2191 37.3130 55.1476 79.5017
frequency: 37.1464 55.0178 79.4618 85.1316 92.7502 133.7883 182.7079 202.4020 205.2136 217.9076 252.6489 264.3079 290.2815 327.3967 331.2220 383.8172 411.3397 444.0050 466.1170 502.3368 547.6586 552.7000 574.4513 612.8398 679.7344 727.9196 753.4835 775.0864 787.9540 809.1274 840.3495 895.9359 903.7309 914.6919 939.0911 963.9279 969.6458 978.3476 1001.8195 1041.1369 1048.2330 1057.7978 1065.6179 1104.4093 1113.6025 1150.4179 1174.2518 1195.3532 1222.9224 1240.8067 1258.6525 1275.4829 1290.2364 1306.7744 1317.2557 1337.4093 1368.1311 1374.6650 1387.5620 1393.3213 1394.5001 1431.5170 1452.4346 1462.7494 1467.3726 1470.3396 1472.3803 1474.9654 1481.5209 1488.9863 1491.9289 1496.1330 1599.7062 1604.4323 2969.2688 2970.6937 2974.9164 2978.1029 2979.4067 3033.3598 3034.8414 3048.1178 3071.5546 3073.7955 3077.0690 3081.5762 3082.9541 3083.4894 3114.0151 3120.8803 3155.0346 3472.4873 3492.9591
redmass: 4.0581 3.8268 3.3906 2.9581 2.5643 3.3492 1.7408 1.1842 1.5243 2.8969 2.6811 1.1660 2.8683 2.5713 2.3624 2.3581 2.0615 1.7810 3.1193 3.3329 3.9594 3.6003 3.0162 2.8477 2.7322 1.8246 2.5869 1.3658 1.4273 2.1913 3.3647 2.5798 1.3450 1.6408 1.9202 1.3346 2.3884 1.9461 1.8901 1.6275 1.7747 1.9166 1.6931 1.6154 1.7901 2.2342 1.1951 1.3659 2.7714 1.7257 1.4826 2.1446 1.4032 1.3474 1.5642 1.2690 3.5575 1.2433 1.2172 1.2090 1.2362 1.8367 2.3301 1.0748 1.3232 1.0809 1.1048 1.0854 1.0798 1.1887 1.1714 1.1336 5.4570 6.0049 1.0410 1.0620 1.0370 1.0365 1.0636 1.0958 1.0860 1.0945 1.0995 1.0992 1.0987 1.0991 1.0991 1.1003 1.0860 1.0915 1.0988 1.0643 1.0734
irintensity: 4.1099 1.4438 1.6143 1.0886 3.6870 0.4347 0.0742 0.1247 0.9108 5.0962 3.9498 0.3031 7.5070 7.2127 0.9612 19.7376 16.4615 136.2742 2.0360 38.7059 1.5649 4.5318 22.2542 41.8084 3.8051 18.6705 38.1324 15.2079 18.5035 5.8905 6.3407 11.5139 1.6485 16.6489 21.5390 0.7620 38.7724 0.8760 6.3130 11.4530 30.2661 3.5759 15.9150 19.8568 15.6759 68.3389 2.2305 24.5524 18.6998 2.4024 7.1934 51.4942 18.3407 2.8851 1.5721 8.5974 17.9999 35.2554 17.8645 12.4908 12.9073 2.8314 99.9365 8.0666 5.2092 13.2537 14.1561 22.4704 2.4208 14.5754 39.1582 13.7472 2.6997 13.7479 25.3755 31.8797 46.0464 31.6757 57.9568 9.0672 15.5544 23.4328 66.7441 13.9652 33.3691 54.7084 39.6678 21.3953 2.2932 30.8764 32.0969 16.9502 5.8538
temp: 298.150 k
press: 1.00000 atm
elementType: 8 7 6 6 6 6 6 6 6 6 6 6 6 6 1 1 1 1 1 1 1 1 1 1 1 1 1 1 1 1 1 1 1
symmnumber: 1
zpe: 750782.4 jmol-1
zpe.correction: 0.285958 hartree
zpe.thermalcorrener: 0.301313 hartree
zpe.thermalcorrenthalpy: 0.302257 hartree
zpe.thermalcorrgfe: 0.243587 hartree
zpe.sumelectzpe: -597.552623 hartree
zpe.sumelectthermal: -597.537268 hartree
zpe.sumelectthermalent: -597.536324 hartree
zpe.sumelectthermalfe: -597.594994 hartree
dipole: -1.0450 0.0364 1.3285
dipole: 1.6906
quadrupole: -93.5376 -78.9544 -88.9802
quadrupole: -4.4971 6.1632 0.6536
quadrupole: -6.3802 8.2030 -1.8228 -4.4971 6.1632 0.6536
hfenergy: -597.838581 hartree
pointgroup: C01 [X(C12H19N1O1)]
dipole: 0.4113875 -0.0035054 0.5226416 debye
polarizability: 175.3587703|1.281687|152.0681878|1.7031154|-9.6804769|97.1592707 unknown
InChI: InChI=1S/C12H19NO/c1-4-11-7-5-6-9(2)12(11)13-10(3)8-14/h5-7,10,13-14H,4,8H2,1-3H3
charge 0 multiplicity 1
33 atoms
O  -3.531876 -0.06136 -1.21474
N  -0.972421 -0.176621 -0.182678
C  -1.999978 0.531857 0.649906
C  0.424313 0.127443 -0.07517
C  1.352441 -0.914204 0.263245
C  0.903652 1.446218 -0.363825
C  0.896698 -2.350496 0.500017
C  -3.164203 0.997615 -0.269484
C  -2.51217 -0.390395 1.779479
C  2.731283 -0.607714 0.344726
C  2.290613 1.708216 -0.25157
C  3.208133 0.698283 0.106799
C  -0.017792 2.545962 -0.862734
C  0.659004 -3.143852 -0.816166
H  -1.520937 1.417222 1.104389
H  -1.15314 -1.1855 -0.188003
H  1.67079 -2.87766 1.087542
H  -0.023992 -2.379107 1.118473
H  -4.074383 1.196975 0.320498
H  -2.878871 1.920357 -0.813969
H  -1.674958 -0.766459 2.3951
H  -3.061037 -1.251013 1.351664
H  -3.208757 0.152909 2.44385
H  3.434624 -1.406709 0.610744
H  2.653468 2.718899 -0.47592
H  4.277321 0.922553 0.184302
H  0.565464 3.333888 -1.369469
H  -0.753319 2.141412 -1.58161
H  -0.589149 3.036897 -0.051188
H  -0.110254 -2.670272 -1.454481
H  0.333637 -4.178356 -0.601559
H  1.588821 -3.190174 -1.410508
H  -2.69082 -0.277512 -1.703266
