program: Gaussian 09
title: 000182297
version: EM64L-G09RevD.01
frameworkgroup: C1[X(C3H5ClO3)]
method: RPBEPBE
basis: SDD
operation: Freq
keyword: #p
keyword: freq=noraman
keyword: PBEPBE/SDD
title: #p freq=noraman PBEPBE/SDD
converged: YES YES NO NO
title: Mulliken charges:
elementType: Cl O O O C C C H H H H H
charge: -0.026952 -0.431182 -0.399392 -0.231035 -0.068912 -0.572638 0.145758 0.273089 0.283066 0.269369 0.364048 0.394782
chargesum: 0.00000
title: Mulliken charges with hydrogens summed into heavy atoms:
elementType: Cl O O O C C C
charge: -0.026952 -0.067134 -0.004611 -0.231035 0.204177 -0.020203 0.145758
polarizability: 6.94059382e+01 1.12078240e+00 4.86800194e+01 -6.28057393e+00 2.32241103e+00 3.39832794e+01
1716.lowfreq: -10.4863 -5.6691 -0.0016 -0.0013 0.0034 8.9820 39.9735 83.7726 163.0606
frequency: 39.8976 83.7694 163.0599 223.8196 280.1155 313.8948 382.8203 479.9410 558.6994 608.0001 646.9920 734.7156 826.6019 884.1550 1005.8749 1040.6330 1081.2181 1171.1677 1215.5427 1272.0270 1296.2608 1328.2923 1379.1648 1431.1822 1647.3427 3032.4277 3059.5716 3149.4206 3480.1851 3515.6724
redmass: 11.0622 4.4912 4.3820 7.6959 2.3404 2.0307 3.0369 3.3722 1.9736 3.4351 2.1991 5.6132 3.0443 2.5505 2.4933 3.2531 2.5871 1.1405 1.2419 1.3123 1.7145 1.2560 1.4380 1.0951 9.2088 1.0836 1.0561 1.1116 1.0654 1.0643
irintensity: 4.9338 3.8599 0.3665 6.9868 62.0476 76.0912 23.7015 19.4923 53.3498 39.3127 123.6187 24.9813 21.7010 16.1077 96.7961 234.7587 28.9959 10.1605 9.1095 56.2294 44.8700 9.3134 29.8318 7.6363 230.6559 12.6276 11.0222 7.5001 31.6892 36.2870
temp: 298.150 k
press: 1.00000 atm
elementType: 17 8 8 8 6 6 6 1 1 1 1 1
symmnumber: 1
zpe: 217316.4 jmol-1
zpe.correction: 0.082771 hartree
zpe.thermalcorrener: 0.090670 hartree
zpe.thermalcorrenthalpy: 0.091614 hartree
zpe.thermalcorrgfe: 0.049077 hartree
zpe.sumelectzpe: -802.481323 hartree
zpe.sumelectthermal: -802.473424 hartree
zpe.sumelectthermalent: -802.472480 hartree
zpe.sumelectthermalfe: -802.515017 hartree
dipole: -2.9954 -2.7219 0.8174
dipole: 4.1291
quadrupole: -50.6568 -48.4286 -46.5418
quadrupole: 4.2909 1.5248 0.3477
quadrupole: -2.1144 0.1138 2.0006 4.2909 1.5248 0.3477
hfenergy: -802.564094 hartree
pointgroup: C01 [X(C3H5Cl1O3)]
dipole: 1.2669911 -0.9792608 -0.2735368 debye
dipolederiv: -0.577156 -0.0346474 0.0254336 -0.0254253 -0.148347 -0.008855 0.0839443 -0.0042019 -0.1773993 -0.3423349 0.0278331 -0.1661365 -0.0842029 -0.7601399 -0.0178999 -0.1606967 0.012453 -0.425704 -0.4262291 0.3414986 -0.1468472 0.3037272 -1.0805092 0.2011889 -0.1145724 0.1649142 -0.4310969 -0.7841274 -0.2443401 0.1742964 -0.0073703 -0.7727969 0.1649183 0.1875498 0.2665762 -0.4185358 -0.2351648 0.0284804 0.1215042 0.0377509 0.633478 -0.0188792 0.1532049 -0.0644168 0.269725 0.7438767 -0.0174897 -0.1152258 0.0965569 0.0715799 -0.0233744 -0.0687242 -0.0785068 0.1668845 1.1553481 -0.009056 -0.1856435 -0.2684718 1.3070446 -0.4170843 -0.3059896 -0.4676402 0.4127442 0.09147 0.0096076 0.0103101 0.0012826 0.0131335 0.0341081 -0.0275485 0.068019 -0.0502596 -0.0202323 0.0455679 0.0256368 0.0314902 -0.0597527 0.0013624 0.0230259 0.0215394 0.0944548 -0.0325582 -0.0177846 0.0557618 -0.0138929 0.0858796 0.0561216 0.0188615 0.0184941 -0.073982 0.2706621 -0.1133764 0.1180217 -0.0096679 0.3686583 -0.0053088 0.0990955 0.0343248 0.2667892 0.1564458 -0.0162935 0.0828884 -0.0617766 0.3417717 0.0337023 0.1118494 0.0284449 0.3663797 unknown
polarizability: 69.1612772|0.2537544|48.1171257|-6.8182257|-3.9959456|34.7908341 unknown
InChI: InChI=1S/C3H5ClO3/c4-1-2(5)3(6)7/h2,5-6H,1H2
charge 0 multiplicity 1
12 atoms
Cl -2.988085 -0.556339 0.08563
O  -0.57303 1.611416 0.097145
O  1.546223 -1.377545 0.338114
O  1.938177 0.729588 -0.574364
C  -0.295073 0.207152 0.321127
C  -1.216421 -0.712193 -0.507989
C  1.172158 -0.091621 -0.022276
H  -0.450092 -0.009114 1.394498
H  -0.946049 -1.770084 -0.376894
H  -1.221326 -0.42247 -1.569283
H  0.167309 1.996214 -0.447512
H  2.50151 -1.541104 0.109604
