program: Gaussian 09
title: 000182296
version: EM64L-G09RevD.01
frameworkgroup: C1[X(C15H24)]
method: RPBEPBE
basis: SDD
operation: Freq
keyword: #p
keyword: freq=noraman
keyword: PBEPBE/SDD
title: #p freq=noraman PBEPBE/SDD
converged: YES YES NO NO
title: Mulliken charges:
elementType: C C C C C C C C C C C C C C C H H H H H H H H H H H H H H H H H H H H H H H H
charge: 0.227159 0.356205 -0.511615 -0.518135 0.542550 -0.490846 -0.471735 -0.600353 -0.806434 -0.831791 -0.542847 -0.423903 0.441808 -0.810665 -0.828192 0.221970 0.208244 0.229271 0.208226 0.219426 0.224978 0.209909 0.222396 0.231405 0.216624 0.219778 0.225837 0.217158 0.235774 0.243228 0.203814 0.220953 0.204471 0.202164 0.220280 0.220493 0.226630 0.217034 0.218729
chargesum: 0.00000
title: Mulliken charges with hydrogens summed into heavy atoms:
elementType: C C C C C C C C C C C C C C C
charge: 0.227159 0.356205 -0.081400 -0.080638 0.542550 -0.046442 -0.039430 -0.152323 -0.143661 -0.148975 -0.117423 -0.221739 0.441808 -0.369893 -0.165798
polarizability: 1.81727652e+02 -6.55208303e+00 1.56923926e+02 1.20492817e+00 2.15564861e+00 1.24103727e+02
1716.lowfreq: -12.0752 -0.0005 -0.0003 0.0002 8.5840 13.2903 57.3693 73.2587 101.3660
frequency: 57.2194 73.1785 101.3309 137.3855 167.6163 180.3674 199.8763 225.8951 237.9038 257.9645 268.1353 279.2016 292.3851 305.5868 319.3887 353.2456 383.6583 401.4160 431.3025 437.6116 465.9228 505.0673 522.3013 557.0050 602.9565 652.3971 698.9499 703.8000 757.6965 776.7920 809.8143 834.6114 843.0321 878.1391 881.0241 897.3410 908.2772 914.7627 917.6518 957.1202 960.1858 965.0145 984.3760 999.2879 1028.0212 1034.5412 1039.5536 1061.1128 1075.1720 1087.2541 1108.5534 1124.4325 1148.4335 1160.6869 1168.3751 1180.4857 1189.1493 1205.6209 1216.8334 1247.3130 1260.1213 1266.7231 1284.1648 1303.1657 1311.5255 1312.6278 1324.4296 1336.4676 1371.2295 1384.1512 1388.9361 1392.4116 1429.7211 1450.9577 1454.7535 1458.7489 1461.2031 1461.8946 1471.5134 1472.2421 1475.1267 1479.7806 1486.5319 1487.3998 1496.4011 1663.7485 1699.0776 2944.6110 2954.4853 2958.0732 2961.8266 2977.4267 2980.4809 2982.9136 2992.6913 2995.5910 3002.9092 3010.1077 3023.5031 3044.1140 3052.9009 3055.6267 3067.7134 3070.9160 3073.0782 3073.5440 3077.7772 3083.9747 3084.9186 3089.0988 3186.2774
redmass: 2.9799 2.9663 2.6948 2.9147 1.3556 1.6038 1.6728 1.9446 2.2707 1.6528 1.3997 2.2557 2.4107 2.5097 2.3215 2.2278 2.1473 2.1671 2.0093 2.3367 2.5399 2.4523 3.5669 3.5416 2.4518 3.5782 1.7766 1.6682 2.2851 2.1036 1.3236 1.8172 1.7699 1.9175 1.8837 1.7495 1.7649 2.0472 1.4440 1.7645 1.7395 1.5603 1.8194 1.8447 1.8138 1.4968 1.8072 1.6540 1.5563 1.7945 1.9104 2.0239 1.8404 1.7743 1.9402 1.7415 2.1895 1.6787 1.8409 1.6972 1.7440 1.7062 1.3459 1.3879 1.3986 1.5162 1.3702 1.6151 1.7876 1.2207 1.1974 1.2419 1.1726 1.0899 1.0797 1.0725 1.0537 1.0742 1.0827 1.0677 1.0600 1.0741 1.0667 1.0634 1.0614 5.6519 6.4617 1.0604 1.0391 1.0668 1.0593 1.0617 1.0397 1.0435 1.0616 1.0803 1.0623 1.0984 1.0966 1.1015 1.0999 1.0958 1.1022 1.0989 1.0986 1.0992 1.0984 1.0987 1.0906 1.0628 1.1126
irintensity: 0.1013 0.0369 0.0404 0.1899 0.7101 0.1900 0.1191 0.1426 0.4639 1.0956 1.0185 0.7258 0.4500 0.0593 0.5775 0.9296 1.1535 0.4448 4.1887 2.0139 0.0124 2.8450 0.9329 0.3015 0.3589 4.7157 1.9626 0.5091 4.6059 4.9108 11.4501 0.8457 2.5092 3.5304 1.5468 3.9881 3.0329 5.5042 55.0643 0.0494 2.6327 3.9253 1.8481 1.8595 1.8146 4.8948 13.1652 6.2515 2.5340 17.7016 7.7052 1.8274 1.8441 3.0379 11.1501 1.2976 0.8075 4.7395 7.4404 6.0732 1.8293 1.3528 0.7974 4.4475 0.5984 1.0665 2.1324 7.3874 3.9449 38.9977 5.8893 10.1336 13.9363 13.7267 5.9446 3.8894 10.0535 3.8315 1.8174 19.1753 0.1944 9.8308 15.6175 5.2398 5.4840 21.7432 0.6926 25.4137 75.6802 21.2462 31.4842 12.3468 43.5557 14.3587 44.7998 35.8101 38.6910 24.1496 30.5294 38.5113 32.2028 38.1181 36.8822 46.5448 4.8543 63.2480 25.6876 33.1610 43.1568 14.5551 25.0737
temp: 298.150 k
press: 1.00000 atm
elementType: 6 6 6 6 6 6 6 6 6 6 6 6 6 6 6 1 1 1 1 1 1 1 1 1 1 1 1 1 1 1 1 1 1 1 1 1 1 1 1
symmnumber: 1
zpe: 916993.5 jmol-1
zpe.correction: 0.349264 hartree
zpe.thermalcorrener: 0.364927 hartree
zpe.thermalcorrenthalpy: 0.365871 hartree
zpe.thermalcorrgfe: 0.308423 hartree
zpe.sumelectzpe: -584.778066 hartree
zpe.sumelectthermal: -584.762403 hartree
zpe.sumelectthermalent: -584.761459 hartree
zpe.sumelectthermalfe: -584.818907 hartree
dipole: -0.0713 -0.8105 -0.0481
dipole: 0.8150
quadrupole: -92.2312 -92.8151 -95.4627
quadrupole: 0.1508 0.9382 0.4240
quadrupole: 1.2718 0.6879 -1.9597 0.1508 0.9382 0.4240
hfenergy: -585.1273299 hartree
pointgroup: C01 [X(C15H24)]
dipole: -0.033435 0.315481 0.0465886 debye
polarizability: 181.5429786|6.8587849|156.4635267|0.6419329|5.1956132|124.7488003 unknown
InChI: InChI=1S/C15H24/c1-12-7-10-14(3,11-8-12)15(4)9-5-6-13(15)2/h7H,2,5-6,8-11H2,1,3-4H3
charge 0 multiplicity 1
39 atoms
C  -1.235714 0.181956 -0.483021
C  0.250734 0.087119 0.110938
C  -1.937518 1.530618 -0.061572
C  1.081672 1.331221 -0.340953
C  -2.196078 -0.901764 0.088792
C  1.005995 -1.185399 -0.389076
C  -3.420112 1.170057 0.208096
C  -3.313076 -0.222773 0.877026
C  -1.266916 0.090224 -2.039025
C  0.204286 0.024963 1.665921
C  2.515026 1.343323 0.239765
C  2.510797 -1.127637 -0.178899
C  3.217359 0.000751 0.104837
C  -2.146171 -2.236932 -0.149298
C  4.718284 -0.007672 0.320686
H  -1.822558 2.309447 -0.836628
H  -1.494742 1.927979 0.870237
H  0.562893 2.263613 -0.048491
H  1.157916 1.334729 -1.44573
H  0.811858 -1.353838 -1.468246
H  0.606571 -2.076666 0.133857
H  -3.982984 1.090371 -0.742018
H  -3.930667 1.918193 0.840621
H  -4.253325 -0.801171 0.867714
H  -3.010157 -0.093305 1.93777
H  -1.008796 -0.917727 -2.406288
H  -2.287095 0.310988 -2.403259
H  -0.578731 0.81813 -2.505268
H  -0.471842 -0.781488 2.002091
H  1.207274 -0.194806 2.071469
H  -0.138009 0.974827 2.116496
H  2.495325 1.639145 1.310895
H  3.112676 2.127111 -0.27064
H  3.04933 -2.082714 -0.273642
H  -1.366792 -2.701011 -0.762689
H  -2.906229 -2.913388 0.260665
H  5.136992 -1.027481 0.257396
H  4.981562 0.408885 1.314108
H  5.234465 0.622825 -0.431137
