program: Gaussian 09
title: 000191671
version: EM64L-G09RevD.01
frameworkgroup: C1[X(C10H6N2O)]
method: RPBEPBE
basis: SDD
operation: Freq
keyword: #p
keyword: freq=noraman
keyword: PBEPBE/SDD
title: #p freq=noraman PBEPBE/SDD
converged: NO YES YES YES
title: Mulliken charges:
elementType: O N N C C C C C C C C C C H H H H H H
charge: -0.318716 -0.037170 -0.003679 0.401980 0.206466 -0.446389 -0.379346 -0.348945 0.395029 -0.387864 -0.203843 -0.236975 -0.253463 0.276297 0.301371 0.244571 0.308112 0.242624 0.239940
chargesum: 0.00000
title: Mulliken charges with hydrogens summed into heavy atoms:
elementType: O N N C C C C C C C C C C
charge: -0.318716 -0.037170 -0.003679 0.401980 0.206466 -0.170091 -0.134774 -0.047575 0.395029 -0.079752 0.038781 0.002965 -0.253463
polarizability: 2.10145964e+02 2.28288955e-01 1.40696834e+02 1.84424046e-02 1.36709740e-02 4.62163219e+01
1716.lowfreq: -0.0010 -0.0006 0.0002 4.4981 12.2558 12.6636 86.0229 129.1217 148.6785
frequency: 86.0012 129.1192 148.6784 191.5227 261.7400 304.5916 386.4419 407.6739 438.4917 440.7952 499.9944 531.9861 545.2335 613.8614 618.6996 622.1990 643.5329 744.4788 753.4522 776.7401 863.3050 867.6764 869.3861 899.4447 972.9599 980.3353 1004.9996 1023.3521 1077.6090 1127.7213 1163.1197 1170.1614 1219.1351 1253.7192 1276.7861 1322.5437 1354.9089 1415.2760 1427.2629 1454.8181 1499.4292 1562.9062 1580.6177 1622.4819 2187.7349 3137.7060 3151.5845 3168.5469 3175.3190 3186.7883 3211.8288
redmass: 6.0633 9.4495 6.5681 4.2914 5.0471 6.7071 9.2118 4.7186 8.3568 3.8220 7.7278 3.6949 9.5787 6.7561 6.6688 4.4626 3.0474 5.2614 2.9230 1.4303 1.4374 5.1299 1.4242 1.5874 5.3365 1.3672 1.3251 2.1121 3.7016 2.1736 1.4169 1.2495 1.7718 2.1355 2.3765 2.5856 3.0510 3.6849 4.3905 2.5508 4.5394 5.1491 7.0531 6.8731 12.6281 1.0870 1.0913 1.0968 1.0937 1.0968 1.0940
irintensity: 0.2760 3.1272 3.4762 4.4798 0.8754 6.0806 0.4117 2.2546 1.3415 3.5200 0.5520 5.0767 6.8975 0.7193 4.8162 8.6987 3.4237 0.9003 4.1140 64.1852 4.1722 0.3477 62.7242 15.1540 18.6264 5.8573 1.0687 3.6065 12.9203 3.8414 21.1519 2.5942 34.0934 1.4562 12.8838 16.7885 35.3666 4.7901 21.2477 3.5367 24.2320 13.8275 22.5521 0.8591 30.4216 0.5975 12.9032 14.7410 0.1715 9.5027 5.0965
temp: 298.150 k
press: 1.00000 atm
elementType: 8 7 7 6 6 6 6 6 6 6 6 6 6 1 1 1 1 1 1
symmnumber: 1
zpe: 355139.6 jmol-1
zpe.correction: 0.135266 hartree
zpe.thermalcorrener: 0.144867 hartree
zpe.thermalcorrenthalpy: 0.145811 hartree
zpe.thermalcorrgfe: 0.100090 hartree
zpe.sumelectzpe: -568.457004 hartree
zpe.sumelectthermal: -568.447402 hartree
zpe.sumelectthermalent: -568.446458 hartree
zpe.sumelectthermalfe: -568.492179 hartree
dipole: 4.5934 -2.9288 0.0002
dipole: 5.4477
quadrupole: -82.0048 -75.8830 -77.0390
quadrupole: -7.6616 -0.0030 -0.0012
quadrupole: -3.6959 2.4259 1.2699 -7.6616 -0.0030 -0.0012
hfenergy: -568.5922692 hartree
pointgroup: C01 [X(C10H6N2O1)]
dipole: 1.7889753 1.1803907 -0.000092 debye
dipolederiv: -0.3339079 0.1975927 0.0000263 0.1518455 -1.0467985 -0.0000998 0.000046 -0.0001833 -0.2998701 0.0462849 -0.3382144 -0.0000444 -0.1664583 1.029898 0.0001475 -0.0000536 0.0002363 0.1019473 -0.4419142 0.0046997 -0.0000772 0.0444702 -0.2134112 0.0000201 0.0000007 0.000007 -0.2321562 0.1132256 0.0737927 0.000003 0.1194222 -0.0326896 -0.0000212 0.0000334 -0.0000128 0.0774514 0.262761 -0.1568269 -0.0000502 -0.0325578 -0.2654323 -0.0000486 -0.0000188 -0.0000328 0.024773 -0.0406775 -0.0305314 -0.0000138 0.0329761 -0.0968875 -0.0000003 -0.0000421 0.0000002 -0.1709132 -0.1432844 -0.0668354 -0.0000069 -0.0067546 0.140969 0.0000332 0.0000012 0.0000427 -0.1566025 -0.2201042 0.0562862 0.0000205 -0.1343805 -0.0215982 0.0000218 -0.0000111 0.0000044 -0.1216034 -0.0619619 -0.0841002 0.0000201 0.0696678 0.3932317 0.0000264 0.0000008 0.0000444 0.1386498 -0.0675834 0.4360044 0.0000752 -0.1706638 -0.0855533 0.0000168 -0.0000359 -0.0000389 -0.1389919 0.1290763 -0.1579538 -0.0000443 -0.0006639 -0.0321511 0.0000127 -0.000022 0.0000343 -0.1433163 0.0617974 0.1198464 -0.0000048 0.1064335 0.1159569 0.0000221 -0.0000116 0.0000154 -0.1292464 0.4495281 -0.0435254 0.000034 -0.0587669 -0.0232694 -0.00002 0.0000419 -0.0000061 0.0279688 0.0744573 0.0019732 0.0000078 0.046901 -0.0003835 -0.000028 0.0000133 -0.0000192 0.1730718 0.1254094 -0.0361712 -0.0000007 0.0539505 0.0473763 -0.0000188 0.0000123 -0.0000142 0.1772634 0.0648739 0.0779058 0.0000176 0.0127952 -0.0571663 -0.0000267 0.0000078 -0.0000322 0.1584145 0.0848812 0.0045215 0.0000059 -0.0067583 0.0683688 -0.0000138 0.0000042 -0.0000205 0.1935225 -0.0867629 0.0443484 0.0000272 0.0470185 0.07832 -0.0000142 0.0000278 -0.0000163 0.1588854 -0.0160983 -0.1028124 0.0000046 -0.1084764 0.0012203 -0.0000091 0.0000056 -0.0000086 0.160752 unknown
polarizability: 210.1361388|0.8569483|140.7066592|-0.0186538|0.0133811|46.2163219 unknown
InChI: InChI=1S/C10H6N2O/c11-6-8-5-9-3-1-2-4-10(9)12(13)7-8/h1-5,7H
charge 0 multiplicity 1
19 atoms
O  0.270676 -2.812336 -0.000472
N  -0.089292 -1.53334 -0.000165
N  -4.387189 0.74286 0.000714
C  0.533586 0.871113 0.000038
C  0.920786 -0.514542 -0.00016
C  -0.851678 1.223346 0.000215
C  1.579802 1.850835 0.00006
C  2.281468 -0.909111 -0.000339
C  -1.810314 0.195134 0.000149
C  -1.413489 -1.172547 -0.000051
C  3.27542 0.07843 -0.000313
C  2.922328 1.462716 -0.000112
C  -3.21806 0.49336 0.000295
H  -1.15994 2.271865 0.000372
H  2.510167 -1.977701 -0.000481
H  1.307598 2.912146 0.000212
H  -2.121334 -2.00171 -0.000126
H  4.330752 -0.212798 -0.000441
H  3.710712 2.222379 -0.000095
