program: Gaussian 09
title: 000182295
version: EM64L-G09RevD.01
frameworkgroup: C1[X(C20H26O3)]
method: RPBEPBE
basis: SDD
operation: Freq
keyword: #pfreq=noraman
keyword: PBEPBE/SDD
title: #p freq=noraman PBEPBE/SDD
converged: YES YES NO NO
title: Mulliken charges:
elementType: O O O C C C C C C C C C C C C C C C C C C C C H H H H H H H H H H H H H H H H H H H H H H H H H H
charge: -0.192510 -0.220828 -0.398143 0.222089 -0.103886 0.190900 -0.474586 -0.624139 0.431995 -0.567222 0.135847 -0.790992 -0.763371 -0.754439 0.101635 -0.041868 -0.549494 -0.588703 0.476886 -0.020659 -0.211332 -0.680471 -0.681473 0.212815 0.233663 0.210422 0.262407 0.250616 0.250329 0.229928 0.238329 0.234599 0.217969 0.238230 0.218553 0.241788 0.218705 0.252135 0.207687 0.258240 0.283834 0.155519 0.228247 0.216229 0.227074 0.226625 0.216239 0.228645 0.345937
chargesum: 0.00000
title: Mulliken charges with hydrogens summed into heavy atoms:
elementType: O O O C C C C C C C C C C C C C C C C C C C C
charge: -0.192510 -0.220828 -0.052206 0.222089 0.108928 0.190900 -0.030501 -0.111115 0.431995 -0.086965 0.135847 -0.100095 -0.064799 -0.075912 0.101635 -0.041868 -0.291253 -0.304869 0.476886 -0.020659 -0.055813 -0.008921 -0.009964
polarizability: 2.93471512e+02 8.72564504e+00 2.25007961e+02 3.07826441e+00 2.25904005e-01 1.57900219e+02
1716.lowfreq: -6.1909 -0.0004 0.0004 0.0008 8.5938 10.6310 13.4977 35.1598 39.9437
frequency: 8.4426 34.7635 39.9271 51.7032 89.1191 105.6723 123.6681 134.9539 152.9073 185.7334 199.6088 207.8950 217.4301 233.2076 244.9615 246.4410 256.6785 260.0176 263.5960 280.3891 292.7109 294.6901 318.5689 335.5868 344.7035 357.8721 388.5077 400.9345 415.2553 431.7085 447.1792 472.0977 484.4506 489.4007 518.0959 534.2956 547.8117 587.2228 601.6457 638.0140 648.6997 687.6155 696.6152 712.7108 721.0834 749.0080 762.1801 798.7337 838.5555 868.7206 887.4874 888.3509 914.8846 916.1543 931.7987 936.6249 947.6581 956.1885 960.6645 970.4724 988.4068 1016.5897 1021.1416 1056.1750 1059.4973 1080.5310 1095.9421 1104.0403 1115.4594 1121.0809 1134.3435 1139.7411 1149.7218 1175.5975 1179.0648 1192.2957 1206.1667 1218.1739 1228.8103 1241.2441 1260.5646 1268.1772 1277.3947 1290.8477 1307.1459 1310.6983 1338.2850 1340.7702 1346.6816 1351.7551 1376.6341 1381.2379 1392.5656 1399.2417 1400.7983 1401.6710 1422.3592 1441.0989 1450.0190 1461.8291 1466.1474 1467.4985 1468.7263 1468.9401 1479.4873 1480.0927 1481.5909 1483.2094 1490.9978 1494.2896 1495.4511 1561.1659 1569.3072 1616.8467 1632.4486 2908.9342 2943.7865 2980.1814 2982.5650 2983.0525 2985.3283 2988.1945 2988.9939 2990.1533 2993.5797 3043.8678 3064.4915 3069.1042 3076.3387 3076.7532 3079.3896 3081.4337 3082.8060 3083.7210 3087.4313 3089.9893 3100.9629 3102.1325 3132.8793 3167.9635 3548.4505
redmass: 2.9589 4.2764 5.7635 4.3888 4.8427 3.4438 3.5980 2.2448 1.2951 3.4310 2.3053 1.6323 1.0569 1.8307 1.7126 1.0928 2.5901 3.5563 2.9810 2.5475 2.6217 3.2399 2.6756 3.8187 3.5782 4.1529 3.7094 1.1466 2.6586 3.3040 3.3611 2.6848 3.6157 3.4442 2.7192 3.6043 3.7924 3.1376 3.8632 4.7915 4.5938 3.9203 5.5052 3.3290 4.2761 3.7090 2.9812 2.4013 2.2395 2.7243 1.7043 2.2854 1.2002 1.9377 1.8741 1.4850 1.5828 1.4784 1.7207 2.2578 2.1788 1.6340 1.8734 1.9896 2.0693 2.1051 2.1860 2.3787 2.4242 2.6745 2.2155 1.6787 1.6086 1.8103 2.2213 2.2694 1.9441 1.9661 4.1155 2.1750 1.3347 1.8174 1.3789 1.7116 2.7939 1.5429 1.4836 1.5976 1.4830 1.3865 1.1850 1.1900 1.2003 1.3385 1.3421 2.2078 4.7106 1.0924 1.0822 1.0476 1.0444 1.1096 1.0502 1.0598 1.0954 1.0530 1.0594 1.3132 1.1848 1.4029 1.1500 7.4199 9.9537 9.7201 7.4434 1.0814 1.0823 1.0350 1.0606 1.0356 1.0612 1.0497 1.0439 1.0384 1.0426 1.1009 1.0943 1.0967 1.1005 1.0991 1.0989 1.1001 1.1005 1.0994 1.0998 1.0995 1.0986 1.0971 1.0905 1.0906 1.0651
irintensity: 0.0829 1.1178 2.1597 2.2947 3.1845 0.4145 1.1443 1.3621 0.4560 0.1463 1.6439 0.2560 0.1080 0.8308 0.4361 0.1177 1.0251 0.4897 5.6543 0.6389 0.2857 1.3602 0.3030 6.1294 4.0928 1.4609 6.4565 106.3647 2.4801 1.1570 0.7432 1.3442 0.9083 8.8302 0.6223 6.4451 3.8547 8.8402 16.5513 5.6711 2.4141 4.9127 0.7397 8.7046 3.2155 16.3829 0.2451 4.8537 5.7545 8.2987 14.1526 12.1330 4.5813 0.9025 8.3074 4.3316 8.4817 0.2652 5.4095 12.7611 14.5192 7.4130 8.4597 12.3226 1.5353 10.8234 23.3781 17.2132 2.0137 30.6963 2.0540 151.1565 52.1431 0.2573 64.6709 34.1544 35.9144 59.6919 18.5472 7.9683 4.6974 5.8590 0.7908 45.1481 162.7586 10.9087 1.5884 5.1014 1.9080 3.0107 11.4244 15.8303 49.0482 18.5027 5.2638 21.2704 17.3047 3.8754 26.1686 0.4071 3.3243 3.2254 3.5340 25.3921 15.6575 5.2306 15.2895 4.3109 28.2582 52.2611 21.3435 42.3574 275.2790 167.5720 71.8370 55.3372 17.7826 27.6103 23.6390 31.9502 12.5368 3.4476 8.3382 33.0294 39.5523 24.8258 13.6963 18.8908 3.5469 34.1809 15.0907 76.4542 28.9564 30.0114 34.7448 36.4767 20.4630 29.1304 6.5304 3.9790 53.4933
temp: 298.150 k
press: 1.00000 atm
elementType: 8 8 8 6 6 6 6 6 6 6 6 6 6 6 6 6 6 6 6 6 6 6 6 1 1 1 1 1 1 1 1 1 1 1 1 1 1 1 1 1 1 1 1 1 1 1 1 1 1
symmnumber: 1
zpe: 1083006.5 jmol-1
zpe.correction: 0.412495 hartree
zpe.thermalcorrener: 0.435647 hartree
zpe.thermalcorrenthalpy: 0.436591 hartree
zpe.thermalcorrgfe: 0.360202 hartree
zpe.sumelectzpe: -1001.680371 hartree
zpe.sumelectthermal: -1001.657220 hartree
zpe.sumelectthermalent: -1001.656276 hartree
zpe.sumelectthermalfe: -1001.732664 hartree
dipole: -3.4696 -2.0823 1.8277
dipole: 4.4401
quadrupole: -131.7340 -151.5571 -140.5322
quadrupole: 9.5427 14.2822 -3.3306
quadrupole: 9.5404 -10.2826 0.7422 9.5427 14.2822 -3.3306
hfenergy: -1002.0928669 hartree
pointgroup: C01 [X(C20H26O3)]
dipole: -1.3700961 0.804398 -0.7261492 debye
polarizability: 293.2303141|-9.3429757|225.0776353|-4.7810244|-1.8686435|158.0717422 unknown
InChI: InChI=1S/C20H26O3/c1-11(2)12-8-13-14(9-15(12)21)20(5)7-6-18(23)19(3,4)17(20)10-16(13)22/h8-9,11,17,21H,6-7,10H2,1-5H3
charge 0 multiplicity 1
49 atoms
O  4.899457 1.052475 1.354953
O  -0.792676 -3.190348 -0.101405
O  -3.289042 2.750587 0.097283
C  1.124264 0.607975 -0.563045
C  1.84116 -0.585317 0.179239
C  3.421063 -0.574703 0.246178
C  1.708871 1.944486 -0.020692
C  1.283926 -1.9413 -0.308132
C  -0.386357 0.495382 -0.247934
C  3.249768 2.0156 -0.141017
C  3.935124 0.853609 0.567802
C  1.242628 0.582245 -2.120853
C  4.126231 -1.001051 -1.083726
C  3.898396 -1.541381 1.363512
C  -1.011121 -0.784773 -0.101392
C  -0.232835 -2.051938 -0.164376
C  -1.207593 1.636706 -0.173458
C  -2.410642 -0.869663 0.113014
C  -3.242419 0.261992 0.190559
C  -2.601055 1.529108 0.042484
C  -4.749742 0.112926 0.425727
C  -5.044714 -0.553245 1.796509
C  -5.429212 -0.663227 -0.734147
H  1.522626 -0.473397 1.240183
H  1.420796 2.064314 1.042511
H  1.279402 2.80402 -0.568615
H  1.723695 -2.790542 0.242766
H  1.529487 -2.107535 -1.376067
H  3.63717 2.955746 0.288259
H  3.543561 2.001979 -1.210054
H  0.880765 -0.368643 -2.548652
H  0.618802 1.389132 -2.546442
H  2.276664 0.739556 -2.469549
H  5.221198 -0.997716 -0.93496
H  3.896168 -0.340073 -1.934972
H  3.831108 -2.028753 -1.359906
H  3.369949 -1.348289 2.314778
H  4.975094 -1.395093 1.550635
H  3.731926 -2.595053 1.079111
H  -0.801504 2.646164 -0.27584
H  -2.828854 -1.877704 0.217584
H  -5.229316 1.118288 0.455255
H  -4.631988 -1.577648 1.828904
H  -6.134503 -0.620571 1.969764
H  -4.592972 0.018383 2.62682
H  -5.252246 -0.169799 -1.706515
H  -6.52027 -0.731999 -0.569704
H  -5.030725 -1.691587 -0.800749
H  -4.256214 2.604075 0.253971
