program: Gaussian 09
title: 000182292
version: EM64L-G09RevD.01
frameworkgroup: C1[X(C10H22O4S)]
method: RPBEPBE
basis: SDD
operation: Freq
keyword: #p
keyword: freq=noraman
keyword: PBEPBE/SDD
title: #p freq=noraman PBEPBE/SDD
converged: YES YES NO NO
title: Mulliken charges:
elementType: S O O O O C C C C C C C C C C H H H H H H H H H H H H H H H H H H H H H H
charge: 1.186154 -0.463846 -0.540886 -0.473962 -0.451426 0.007801 -0.435895 -0.427414 -0.380659 -0.343396 -0.355501 -0.352130 -0.347749 -0.693478 -0.692682 0.243868 0.218464 0.219738 0.214703 0.224667 0.192645 0.204804 0.201084 0.190690 0.201684 0.191372 0.193872 0.199542 0.195209 0.192954 0.210766 0.212405 0.219548 0.216567 0.214323 0.210033 0.396132
chargesum: 0.00000
title: Mulliken charges with hydrogens summed into heavy atoms:
elementType: S O O O O C C C C C C C C C C
charge: 1.186154 -0.463846 -0.144754 -0.473962 -0.451426 0.251669 0.002307 0.011955 0.016789 0.048378 0.037554 0.041284 0.040413 -0.050759 -0.051758
polarizability: 1.60899816e+02 7.41583005e-01 1.66220112e+02 6.59071803e-01 -2.12932709e+00 1.29191472e+02
1716.lowfreq: -22.8114 -7.6324 -3.4530 0.0017 0.0019 0.0026 5.2342 21.9124 33.7098
frequency: -16.2775 21.8467 33.2335 35.7550 46.4310 47.6981 76.3244 103.1588 108.4103 117.4265 131.0759 146.1230 172.9868 199.3714 208.2311 213.4297 225.6556 233.0139 273.3205 320.2867 324.5651 331.2504 360.5725 368.0063 391.3177 434.6595 471.2825 520.6818 567.0250 580.4891 718.2137 723.1987 750.2594 764.0231 822.9728 829.9089 866.0523 881.7765 897.3991 911.3977 929.0831 942.1786 987.8912 1006.5673 1033.0517 1044.7227 1065.0923 1074.0954 1079.8698 1091.0931 1103.2849 1121.0279 1132.7012 1150.9488 1195.7426 1213.2856 1222.8080 1256.6710 1269.8726 1273.5846 1278.8578 1286.9958 1290.3065 1303.8843 1318.1409 1333.9251 1342.0168 1351.8373 1356.8168 1359.4581 1391.2602 1391.3656 1445.1322 1464.0459 1466.2872 1466.6402 1468.5112 1475.5560 1475.8573 1476.8123 1478.6123 1486.5915 1487.9522 2959.7705 2963.0214 2965.3410 2970.2392 2973.1574 2974.5794 2974.7686 2977.5497 2978.2207 2997.2126 3000.6385 3004.4463 3016.7921 3024.3583 3038.3539 3043.3132 3048.2796 3070.7718 3071.0921 3074.3033 3075.2756 3460.2281
redmass: 3.5175 8.6320 4.0439 5.0833 1.5774 1.6280 3.2399 3.7526 2.4703 3.1922 2.1063 2.1383 5.0567 2.3996 2.0345 1.6204 1.3875 1.6169 2.6988 3.1492 5.9639 7.5428 5.1638 5.0646 2.5514 4.3475 2.7015 4.3621 5.0167 10.3425 1.2767 1.0975 1.4840 1.2507 1.4757 1.9036 7.9384 2.0389 1.6945 1.5905 1.7038 1.6484 9.1600 2.0337 2.6580 2.3209 2.1409 1.8984 2.3850 1.8436 1.3172 1.7465 2.6587 2.0997 1.5155 1.4335 1.3385 1.3257 1.2392 1.2269 1.2082 1.0727 1.0828 1.1589 1.2778 1.4150 1.3438 1.5278 1.6038 1.5161 1.2148 1.2157 1.0786 1.0697 1.0948 1.0711 1.0735 1.0557 1.0534 1.0420 1.0650 1.0822 1.0866 1.0588 1.0592 1.0602 1.0606 1.0610 1.0364 1.0366 1.0613 1.0607 1.0955 1.0880 1.0959 1.1002 1.1006 1.1016 1.1029 1.1024 1.1007 1.1007 1.0994 1.0993 1.0654
irintensity: 0.6332 1.5445 0.4398 1.2502 0.2028 0.0731 0.3129 11.9741 4.3525 8.1955 10.5792 31.7510 5.9021 7.4648 1.9753 3.0590 0.6672 2.8087 20.8947 4.8421 19.6533 14.4565 4.1237 20.5088 2.5764 32.1715 2.4828 8.5835 30.2596 158.8685 4.8170 11.2567 18.3084 6.3569 12.2912 16.6512 95.1647 18.7784 6.8500 5.4690 31.2714 7.2203 85.2133 6.6034 6.3839 0.6477 6.9066 16.3808 0.8258 22.5899 85.2404 2.5651 9.1499 8.3294 0.4974 5.3672 7.3145 2.7833 3.5066 1.2821 3.1050 0.9317 1.6136 5.2457 1.7331 3.3903 2.8419 5.1493 4.6049 9.8553 7.1946 16.4047 7.1908 1.4448 10.8621 0.4484 3.9345 2.5226 10.9356 13.4620 3.7783 12.4260 25.6728 2.2571 6.7934 8.1984 15.9187 84.3035 32.2414 39.8238 31.0039 38.9158 4.9467 2.1619 5.7947 1.7682 2.2698 53.4858 54.3034 47.0533 72.6973 95.1526 51.2726 50.6442 53.4575
temp: 298.150 k
press: 1.00000 atm
elementType: 16 8 8 8 8 6 6 6 6 6 6 6 6 6 6 1 1 1 1 1 1 1 1 1 1 1 1 1 1 1 1 1 1 1 1 1 1
symmnumber: 1
zpe: 815141.3 jmol-1
zpe.correction: 0.310471 hartree
zpe.thermalcorrener: 0.330332 hartree
zpe.thermalcorrenthalpy: 0.331276 hartree
zpe.thermalcorrgfe: 0.259530 hartree
zpe.sumelectzpe: -1091.765126 hartree
zpe.sumelectthermal: -1091.745265 hartree
zpe.sumelectthermalent: -1091.744321 hartree
zpe.sumelectthermalfe: -1091.816068 hartree
dipole: 0.1880 5.2726 -1.1899
dipole: 5.4085
quadrupole: -95.0641 -116.9988 -106.0291
quadrupole: 2.9170 1.4177 0.0689
quadrupole: 10.9666 -10.9681 0.0015 2.9170 1.4177 0.0689
hfenergy: -1092.0755972 hartree
pointgroup: C01 [X(C10H22O4S1)]
dipole: 0.2888633 -2.0157497 -0.6173135 debye
polarizability: 160.8270144|-0.1814383|165.8085724|-0.6095631|4.7388207|129.6758135 unknown
InChI: InChI=1S/C10H22O4S/c1-3-5-7-9-10(8-6-4-2)14-15(11,12)13/h10-11H,3-9H2,1-2H3
charge 0 multiplicity 1
37 atoms
S  -1.268651 2.405543 0.494672
O  -1.411951 0.866158 -0.527489
O  -3.077999 2.518242 0.636041
O  -0.58151 2.034519 1.899735
O  -0.782094 3.690328 -0.323604
C  -0.194532 -0.021709 -0.510843
C  0.895277 0.560985 -1.430284
C  -0.760663 -1.381888 -0.967455
C  2.277761 -0.123869 -1.27328
C  -1.635843 -2.096576 0.083693
C  2.957076 0.117142 0.095949
C  -2.187591 -3.448217 -0.423997
C  4.389018 -0.462993 0.163054
C  -3.042884 -4.179347 0.632696
C  5.067281 -0.225882 1.529279
H  0.157038 -0.086465 0.538306
H  0.54857 0.485414 -2.479248
H  1.014411 1.641914 -1.213875
H  0.105299 -2.023179 -1.229736
H  -1.33215 -1.226511 -1.903992
H  2.191577 -1.214334 -1.458976
H  2.943055 0.267327 -2.068686
H  -2.480763 -1.440247 0.370938
H  -1.041931 -2.266602 1.005613
H  2.993953 1.207436 0.297718
H  2.354897 -0.328119 0.914023
H  -1.341922 -4.097627 -0.730532
H  -2.792882 -3.274916 -1.33704
H  5.002846 -0.007999 -0.641042
H  4.353294 -1.550986 -0.051174
H  -3.910436 -3.56382 0.936775
H  -2.45138 -4.396072 1.542066
H  -3.430058 -5.139202 0.245094
H  6.089641 -0.645562 1.551776
H  5.139844 0.855022 1.752669
H  4.489722 -0.697391 2.346663
H  -3.41552 1.596881 0.427293
