program: Gaussian 09
title: 000182284
version: EM64L-G09RevD.01
frameworkgroup: C1[X(C12H6Cl2FNO4)]
method: RPBEPBE
basis: SDD
operation: Freq
keyword: #p
keyword: freq=noraman
keyword: PBEPBE/SDD
title: #p freq=noraman PBEPBE/SDD
converged: NO NO NO NO
title: Mulliken charges:
elementType: Cl Cl F O O O O N C C C C C C C C C C C C H H H H H H
charge: 0.017011 -0.012494 -0.167105 -0.259697 -0.381927 -0.191256 -0.278912 0.032189 0.420777 0.259356 -0.424413 0.259795 -0.367591 0.180377 -0.323975 -0.235153 0.311950 -0.224300 -0.347763 -0.072533 0.286689 0.273059 0.290740 0.288826 0.294148 0.372201
chargesum: 0.00000
title: Mulliken charges with hydrogens summed into heavy atoms:
elementType: Cl Cl F O O O O N C C C C C C C C C C C C
charge: 0.017011 -0.012494 -0.167105 -0.259697 -0.009726 -0.191256 -0.278912 0.032189 0.420777 0.259356 -0.137724 0.259795 -0.094533 0.180377 -0.033235 -0.235153 0.311950 0.064526 -0.053615 -0.072533
polarizability: 2.90673371e+02 -1.34064404e+01 1.54821428e+02 -1.12065042e+01 1.14450733e+01 1.18385932e+02
1716.lowfreq: -8.6501 -0.0017 -0.0015 0.0013 3.5239 5.9106 15.7929 27.9265 33.3633
frequency: 15.5295 27.7818 33.3429 88.1398 96.5376 106.2547 148.9065 163.7423 196.6717 210.7313 223.2442 236.9409 262.7107 295.5702 306.9557 320.4198 366.7616 384.1144 415.0834 442.7619 460.7473 486.7676 511.1997 526.4113 560.2201 568.4723 572.6324 605.2154 625.1532 655.8181 674.4020 702.9398 734.6970 750.5314 766.3344 818.4942 828.5387 848.3336 854.6075 856.5886 883.2493 892.9454 954.8887 974.1798 1057.9272 1070.7527 1113.9426 1134.1914 1153.3575 1187.6039 1194.7591 1224.4054 1246.3736 1276.9124 1312.0680 1359.8093 1373.4274 1391.8211 1418.4468 1445.0316 1466.7909 1502.3944 1571.8999 1579.1748 1591.0963 1630.5314 2865.1813 3176.1551 3182.0567 3190.3167 3193.0587 3195.1704
redmass: 14.6354 8.6060 15.6521 8.5088 12.4892 11.9559 10.8489 16.1670 14.2382 6.4084 5.2981 11.6051 9.8909 9.6795 7.4562 9.0343 10.8478 12.5480 9.7899 3.1593 9.1057 8.9719 8.0631 4.9482 6.6626 5.1689 6.1203 6.2462 5.8856 3.9933 6.4455 5.5783 6.9752 10.5625 9.3949 1.4467 7.5552 1.4707 1.4491 1.4916 1.0693 9.8755 3.5602 1.2963 5.2681 2.0904 1.7743 2.6157 2.9462 3.0041 1.6153 1.5845 3.8020 4.2553 2.0762 9.9232 4.4168 4.4766 6.6670 4.0806 3.1950 2.9559 9.4033 5.8959 8.5908 6.0210 1.0665 1.0886 1.0923 1.0934 1.0942 1.0981
irintensity: 0.0663 0.0959 0.1545 3.2901 0.1212 0.2786 0.2630 1.0573 1.8084 0.7197 0.6401 1.8906 0.6838 8.0343 3.7542 1.5261 8.8431 3.6542 1.9788 3.7332 2.8166 2.1899 2.3001 1.3168 14.4698 7.8796 3.1534 0.3342 7.0728 13.3311 18.4936 4.0060 5.1743 61.6211 5.4705 26.2590 13.2470 52.1231 19.9741 37.5030 113.9172 107.3246 70.6060 1.0174 12.9385 1.9162 264.7353 35.4534 129.4021 337.2201 24.1617 24.1822 57.5344 404.1166 151.4947 8.2907 116.4974 43.8410 21.0952 319.6011 106.4098 34.4201 86.7608 53.8411 93.0088 399.5736 195.3687 1.4619 0.7582 3.1619 3.2217 1.8653
temp: 298.150 k
press: 1.00000 atm
elementType: 17 17 9 8 8 8 8 7 6 6 6 6 6 6 6 6 6 6 6 6 1 1 1 1 1 1
symmnumber: 1
zpe: 416062.5 jmol-1
zpe.correction: 0.158470 hartree
zpe.thermalcorrener: 0.175731 hartree
zpe.thermalcorrenthalpy: 0.176675 hartree
zpe.thermalcorrgfe: 0.110626 hartree
zpe.sumelectzpe: -1834.977395 hartree
zpe.sumelectthermal: -1834.960134 hartree
zpe.sumelectthermalent: -1834.959190 hartree
zpe.sumelectthermalfe: -1835.025239 hartree
dipole: 4.5266 1.1350 0.8525
dipole: 4.7440
quadrupole: -150.5949 -126.8604 -128.0396
quadrupole: -7.1082 -5.6505 -1.1998
quadrupole: -15.4299 8.3046 7.1253 -7.1082 -5.6505 -1.1998
hfenergy: -1835.135865 hartree
pointgroup: C01 [X(C12H6Cl2F1N1O4)]
dipole: 1.8065732 0.3949015 0.2527996 debye
dipolederiv: -0.1017411 0.1277229 -0.0474486 0.1184838 -0.4735179 0.2560791 -0.0391443 0.2816858 -0.1835375 -0.6749513 0.2956134 0.1048945 0.3563743 -0.2484542 -0.019463 0.1607605 -0.0384282 -0.0943443 -0.5144482 -0.1230148 0.3619824 -0.1026055 -0.2677458 0.2454246 0.3380244 0.2271793 -0.5816121 -2.5102907 -0.011826 -0.0204682 0.1129024 -0.2980135 -0.066743 0.1870511 -0.0869342 -0.2579129 -0.4978596 -0.1257184 -0.0886472 -0.1484399 -0.8370975 -0.3527616 -0.1173874 -0.3532439 -0.6186253 -1.0852215 0.1448156 0.1050801 0.3823518 -0.4072741 -0.1396498 0.2685174 -0.1382192 -0.3179388 -0.6295636 -0.0740034 -0.0534598 -0.3708548 -0.6732317 -0.2894775 -0.2741534 -0.2873172 -0.491586 2.325079 0.0757291 0.0595817 0.2130315 0.7865574 0.4220116 0.1754045 0.4202786 0.5187445 2.3274585 0.1206856 0.109146 0.3166855 0.3837866 0.1927989 0.1048975 0.2020652 0.3069839 1.21398 -0.0748013 -0.1210342 -0.8022169 -0.0933852 0.2117009 -0.4086756 0.1488188 -0.0397981 -0.5409045 -0.2921005 -0.218791 -0.3967842 -0.3457146 -0.1322114 -0.267435 -0.1293528 -0.2715197 -1.3217917 -0.0111046 -0.0096576 -0.3823855 -0.2066816 -0.1434049 -0.2805054 -0.1400894 -0.1215354 -1.0000137 0.0114476 0.0027669 0.1627804 -0.0443589 0.0975637 0.0955078 0.0893087 -0.1102132 0.8967002 0.3138199 0.2262593 0.0397835 0.7095718 0.4154515 0.0408033 0.4127073 0.4489392 0.4632935 0.0464555 0.0385072 0.5177536 0.0741824 0.1007982 0.3845396 0.1001413 0.008418 0.1410391 -0.2760947 0.0337027 -0.0971274 0.7585234 -0.445608 -0.0406617 -0.4447911 0.2890335 0.496558 0.0314298 -0.3856262 0.1189055 0.3785169 -0.3297925 -0.3006436 -0.2656876 0.6413914 -0.392538 0.2216732 -0.029149 0.2513672 -0.3694905 0.085338 -0.0127071 0.0876275 -0.1104727 -0.4267207 0.0558669 0.1451332 0.1707352 -0.1446673 -0.040732 0.076899 -0.0072759 -0.1775518 1.0119747 -0.4695266 -0.2610011 -0.6062866 0.4307402 -0.0483064 -0.2566529 -0.0580946 0.1589965 0.0614166 0.0278157 0.021046 0.0774771 0.0867986 -0.0461382 0.0812058 -0.0410613 0.1206174 0.1025874 -0.0328097 -0.0217479 -0.0243129 0.0621158 -0.0785262 -0.0205733 -0.0760026 0.1130575 0.0626213 0.0518832 0.0378049 -0.0063008 0.1183065 -0.0335107 -0.0066013 -0.0319742 0.143003 0.0838552 0.0039855 0.0463977 0.0156254 0.1168988 0.0430521 0.0497558 0.0411209 0.1051206 0.1054576 0.0286774 0.0170534 0.0346398 0.0939596 0.0599432 0.0278294 0.0508824 0.1328051 0.4040234 -0.0666215 -0.0523252 0.0484175 0.4096749 0.0361634 0.0339448 0.0366564 0.3895373 unknown
polarizability: 288.5877936|-21.2012689|158.8818013|-11.4698016|7.3666146|116.4111361 unknown
InChI: InChI=1S/C12H6Cl2FNO4/c13-6-3-8(14)12(9(15)4-6)20-7-1-2-10(16(18)19)11(17)5-7/h1-5,17H
charge 0 multiplicity 1
26 atoms
Cl 2.32146 2.47984 -1.49337
Cl 5.796853 -1.741755 -0.537891
F  1.367219 -1.136078 2.102363
O  0.73923 1.2588 0.791022
O  -2.366126 -1.773283 -1.400403
O  -5.54347 0.461945 0.208469
O  -4.838838 -1.296323 -1.063485
N  -4.593332 -0.23839 -0.294064
C  -0.559142 0.804011 0.48079
C  1.862824 0.506183 0.407985
C  -0.809719 -0.312382 -0.329862
C  -3.214488 0.105062 -0.039612
C  -1.606649 1.590598 1.041053
C  -2.148447 -0.682908 -0.605127
C  -2.927305 1.234267 0.776357
C  2.748088 0.979443 -0.587065
C  2.229163 -0.66892 1.106531
C  3.950295 0.30644 -0.886566
C  3.411044 -1.374855 0.840046
C  4.257092 -0.863839 -0.16411
H  -0.009781 -0.912158 -0.770349
H  -1.352964 2.450799 1.664295
H  -3.764751 1.805193 1.185631
H  4.620682 0.68669 -1.66024
H  3.653142 -2.278438 1.403774
H  -3.388878 -1.88154 -1.485572
