program: Gaussian 09
title: 000182280
version: EM64L-G09RevD.01
frameworkgroup: C1[X(C15H20O3)]
method: RPBEPBE
basis: SDD
operation: Freq
keyword: #pfreq=noraman
keyword: PBEPBE/SDD
title: #p freq=noraman PBEPBE/SDD
converged: YES YES NO NO
title: Mulliken charges:
elementType: O O O C C C C C C C C C C C C C C C H H H H H H H H H H H H H H H H H H H H
charge: -0.311592 -0.190017 -0.287523 -0.042754 -0.489283 -0.694822 -0.695981 0.199887 0.270745 0.159606 0.572426 -0.307590 -0.536171 -0.420748 -0.328689 -0.157257 -0.526143 -0.742422 0.225256 0.227986 0.224987 0.212232 0.206720 0.241494 0.220756 0.209951 0.213005 0.256608 0.253616 0.224769 0.225633 0.213272 0.218359 0.246596 0.230715 0.224563 0.225067 0.226744
chargesum: 0.00000
title: Mulliken charges with hydrogens summed into heavy atoms:
elementType: O O O C C C C C C C C C C C C C C C
charge: -0.311592 -0.190017 -0.287523 0.182501 -0.036309 -0.034376 -0.052269 0.199887 0.270745 0.159606 0.572426 -0.050982 -0.282555 -0.195979 -0.103056 0.056015 0.169527 -0.066049
polarizability: 2.94321023e+02 1.62958063e+01 1.65813645e+02 -1.06429787e+01 7.19784723e+00 1.11933759e+02
1716.lowfreq: -4.9512 -1.5058 -0.0011 -0.0008 0.0003 5.6091 16.5489 31.1326 33.6041
frequency: 16.2003 31.0822 33.5456 46.4883 54.4663 80.2170 86.8668 109.7320 132.5692 143.2465 150.7564 176.7560 182.1039 204.5981 217.9496 229.9959 260.7036 277.7433 318.7978 325.5466 336.1233 369.2731 375.1018 395.7440 418.6899 457.2374 473.5305 560.0778 579.7135 610.0905 627.2051 679.7434 710.6886 741.2847 759.1788 804.6964 819.3570 828.8005 848.5690 884.6758 899.4029 901.0916 925.6891 942.6528 946.9528 948.6635 962.5977 983.4739 993.8459 1042.2214 1059.9470 1087.8319 1110.7586 1111.8734 1128.0720 1154.2394 1162.7173 1172.7239 1176.8993 1187.7832 1235.4977 1246.1767 1274.1938 1276.7668 1300.7965 1312.7801 1323.4164 1334.7597 1377.2084 1382.6880 1393.4278 1399.8401 1401.9457 1436.3512 1444.5879 1457.5402 1458.6979 1467.3705 1470.0338 1470.8888 1480.7188 1482.4272 1487.8988 1490.1676 1576.3188 1607.9593 1666.9633 1672.3735 2961.6987 2970.5907 2971.9684 2977.3053 2996.2154 3007.1518 3033.3682 3064.1934 3071.0855 3072.6713 3073.1223 3074.7986 3080.7019 3082.3726 3084.1918 3100.3399 3121.7886 3146.6001 3148.6875 3179.2881
redmass: 3.6041 3.8429 4.3299 3.2545 2.6960 2.5072 2.8841 3.1816 2.3110 3.6859 1.8535 1.9477 1.3060 1.0684 2.7618 1.5915 2.3435 3.6673 4.4241 3.7333 3.4724 2.4526 3.8562 3.9651 2.0752 4.1703 3.4728 5.3229 4.8353 5.0440 3.5220 4.8287 4.3806 4.8704 3.8862 1.4690 2.8448 1.7869 3.4700 3.8866 1.6063 1.6937 1.1870 1.9913 1.4314 2.0749 1.5579 1.1325 3.0121 1.5435 2.2535 3.1277 1.2382 2.4766 2.4146 1.3771 2.2936 1.7351 1.6434 1.8206 1.4034 2.2560 1.5997 1.3351 1.9971 1.2905 1.3621 1.4599 4.7196 1.2081 1.3522 2.2667 1.2088 1.3217 1.0972 1.0557 1.0475 1.0486 1.0488 1.0779 1.0549 1.0543 1.0494 2.9393 7.2608 6.6445 10.8838 5.7010 1.0367 1.0354 1.0329 1.0363 1.0829 1.0599 1.0966 1.0998 1.1001 1.1005 1.0955 1.0998 1.0996 1.0920 1.1015 1.0903 1.1032 1.0906 1.0894 1.0958
irintensity: 0.4854 0.3503 1.3654 0.2236 0.1279 4.1296 3.8079 1.0530 1.0934 0.7791 2.6197 3.1979 2.4045 0.1852 0.6059 2.3988 3.4251 1.8899 0.6722 4.0629 0.4322 0.8735 0.6683 0.4734 1.0717 9.9127 6.4882 4.8376 2.1041 5.9520 4.5659 6.5659 4.3042 12.1641 7.1889 34.9634 5.5450 8.8062 74.2280 29.7963 15.8394 5.2030 5.1172 65.3214 8.3441 44.0579 0.5945 58.5060 29.4559 1.0647 294.8102 65.1155 6.5805 5.5704 15.5230 8.9636 184.3293 65.1731 57.1829 7.9814 89.4275 72.6011 59.7401 2.1617 11.3549 0.5197 6.2532 5.0218 6.5910 16.9409 7.4553 21.0213 17.6744 6.3375 6.6127 12.3397 14.4479 1.1648 6.3074 9.5061 15.3407 4.5923 19.7371 126.9075 31.5742 26.4117 156.6425 14.6866 55.0595 33.0542 83.1726 22.8248 8.7008 15.6152 25.2116 21.2393 14.5689 37.6140 8.9694 38.2616 51.5162 11.6164 53.6352 55.5614 22.0873 8.9760 7.2549 4.2159
temp: 298.150 k
press: 1.00000 atm
elementType: 8 8 8 6 6 6 6 6 6 6 6 6 6 6 6 6 6 6 1 1 1 1 1 1 1 1 1 1 1 1 1 1 1 1 1 1 1 1
symmnumber: 1
zpe: 821873.5 jmol-1
zpe.correction: 0.313035 hartree
zpe.thermalcorrener: 0.333350 hartree
zpe.thermalcorrenthalpy: 0.334294 hartree
zpe.thermalcorrgfe: 0.261737 hartree
zpe.sumelectzpe: -807.875102 hartree
zpe.sumelectthermal: -807.854787 hartree
zpe.sumelectthermalent: -807.853843 hartree
zpe.sumelectthermalfe: -807.926400 hartree
dipole: 0.4693 1.3249 -2.1626
dipole: 2.5792
quadrupole: -83.8778 -106.7263 -110.9818
quadrupole: 4.4424 -3.3027 2.0832
quadrupole: 16.6508 -6.1976 -10.4531 4.4424 -3.3027 2.0832
hfenergy: -808.1881373 hartree
pointgroup: C01 [X(C15H20O3)]
dipole: 0.174845 0.2941432 -0.9553041 debye
polarizability: 293.9828581|13.2749564|165.9973275|-16.1247129|-6.7895981|112.0882416 unknown
InChI: InChI=1S/C15H20O3/c1-5-6-12-7-8-13(14(10-12)17-4)18-15(16)9-11(2)3/h5-8,10-11H,9H2,1-4H3
charge 0 multiplicity 1
38 atoms
O  1.360677 -0.308252 -0.74619
O  1.669425 -2.01274 0.850943
O  0.241655 2.279823 -0.270151
C  4.25738 0.208311 0.086124
C  3.595373 -1.11409 -0.419085
C  4.215801 0.309326 1.627803
C  5.708412 0.28885 -0.441338
C  2.145142 -1.244803 -0.004316
C  -0.042811 -0.182301 -0.507943
C  -0.565366 1.12588 -0.328653
C  -2.836577 0.173898 -0.080383
C  -0.906552 -1.298831 -0.497325
C  -1.950794 1.284184 -0.115591
C  -2.285464 -1.123978 -0.285509
C  -4.27347 0.422747 0.157915
C  -5.269891 -0.505728 0.229024
C  1.015247 2.599305 -1.488501
C  -6.723329 -0.185202 0.48013
H  3.678966 1.05344 -0.337126
H  3.656127 -1.148045 -1.522773
H  4.140961 -1.980671 -0.005686
H  4.696583 1.245078 1.966657
H  4.754706 -0.53866 2.091845
H  3.180341 0.303085 2.012528
H  6.187935 1.23129 -0.119339
H  6.317023 -0.548608 -0.04931
H  5.743881 0.248246 -1.546239
H  -0.490426 -2.300166 -0.634241
H  -2.326718 2.302777 0.031769
H  -2.933152 -2.006179 -0.274816
H  -4.549067 1.479581 0.29328
H  -5.029701 -1.571824 0.102019
H  0.33125 2.780181 -2.340307
H  1.719849 1.787632 -1.738595
H  1.562544 3.523297 -1.247042
H  -6.886197 0.900642 0.597765
H  -7.361647 -0.540711 -0.353004
H  -7.091115 -0.689184 1.39586
