program: Gaussian 09
title: 000182276
version: EM64L-G09RevD.01
frameworkgroup: C1[X(C15H18O3)]
method: RPBEPBE
basis: SDD
operation: Freq
keyword: #pfreq=noraman
keyword: PBEPBE/SDD
title: #p freq=noraman PBEPBE/SDD
converged: NO YES NO NO
title: Mulliken charges:
elementType: O O O C C C C C C C C C C C C C C C H H H H H H H H H H H H H H H H H H
charge: -0.297814 -0.238686 -0.205796 0.344418 -0.304798 -0.205628 -0.575284 0.282372 -0.141022 -0.195198 -0.821242 0.177338 -0.438137 -0.479820 0.344596 0.074737 -0.816845 -0.712834 0.260012 0.240254 0.232752 0.236389 0.249594 0.231829 0.251208 0.240728 0.218362 0.208916 0.215084 0.219580 0.214222 0.223673 0.237539 0.240552 0.229277 0.259671
chargesum: 0.00000
title: Mulliken charges with hydrogens summed into heavy atoms:
elementType: O O O C C C C C C C C C C C C C C C
charge: -0.297814 -0.238686 -0.205796 0.344418 -0.044786 0.034625 -0.106143 0.282372 0.108572 0.036630 -0.110945 0.177338 -0.014136 -0.046018 0.344596 0.074737 -0.115080 -0.223885
polarizability: 1.85073546e+02 1.25307630e+01 1.44664782e+02 2.16479205e+00 9.28477418e-01 1.46835219e+02
1716.lowfreq: -9.0493 -1.0751 -0.0007 -0.0006 -0.0005 17.5888 40.0045 57.2435 85.4136
frequency: 39.9024 57.1843 85.3795 97.1332 131.8797 138.7037 180.2583 199.0681 209.1763 228.4583 264.0624 277.7271 298.8113 309.5205 330.7552 346.4613 359.2618 386.8673 417.5509 473.4625 485.1595 511.4671 537.1237 551.3889 583.3622 601.3941 641.5782 651.2842 680.7549 712.1539 762.6620 776.7189 780.7700 798.6256 822.5743 840.0951 880.5404 902.4250 923.0377 932.6818 944.1976 962.0383 971.7010 990.4074 1002.0621 1013.1820 1031.5042 1043.3143 1055.2467 1065.7430 1074.1300 1080.6681 1122.0620 1154.3049 1175.4662 1187.5799 1199.1287 1215.9487 1230.7338 1249.0454 1254.3139 1255.8714 1273.2033 1275.9172 1293.4594 1298.7681 1309.9900 1335.2818 1358.3285 1371.2042 1390.4381 1394.2530 1418.4325 1419.7755 1434.9871 1457.3278 1467.6658 1472.2040 1473.6785 1475.1770 1485.0571 1668.2133 1682.3417 1708.1809 2949.0250 2961.5957 2971.6835 2974.6408 2981.7965 2985.1171 2991.3185 2997.0111 3029.7501 3034.6577 3040.4417 3041.8065 3071.0322 3095.4603 3097.3920 3099.1141 3134.9441 3205.1415
redmass: 4.4839 5.5399 4.4996 3.3002 1.1682 4.4055 2.4040 1.6076 2.4617 1.7786 2.3320 3.1968 3.0761 3.5824 3.6808 4.4665 3.3556 3.6677 3.1144 3.4878 3.8212 4.0210 3.5510 4.4751 3.7005 2.4650 5.0962 4.7904 3.5414 4.6486 2.8279 3.9477 2.0362 3.2637 3.0637 2.6694 2.8151 2.1397 2.9038 1.9703 2.7729 1.7779 1.4128 1.8662 1.6941 1.8330 3.2232 1.9187 1.8360 2.0559 1.5038 2.2261 2.2240 2.5524 1.2011 1.1764 1.4341 1.8845 1.9721 1.5521 2.1342 1.6460 1.7164 2.0231 1.7519 1.7856 1.5306 1.3989 1.3853 1.5579 1.2539 1.2105 2.5232 1.2937 1.1460 1.0797 1.0584 1.0851 1.0554 1.0906 1.0827 6.7329 11.2458 8.2854 1.0602 1.0411 1.0792 1.0624 1.0374 1.0931 1.0832 1.0697 1.0959 1.0981 1.0906 1.0965 1.0986 1.0985 1.0618 1.0952 1.0934 1.1154
irintensity: 0.2858 4.4419 2.9750 1.6017 0.4521 2.1249 0.6729 0.0225 2.4297 0.6237 1.0777 0.6572 1.9031 4.7927 0.8169 4.4577 5.7665 1.8498 3.0194 0.7581 7.5777 5.6506 3.5506 2.7894 0.8098 15.6620 3.8207 10.1177 0.6979 1.5938 0.8570 21.1816 18.8067 0.6524 3.0458 4.8063 27.6728 1.4713 4.9394 1.4682 38.1257 13.2974 46.6354 1.5447 13.6330 9.7959 164.1314 1.1580 1.1591 10.8707 10.7549 3.6257 4.8706 1.2908 1.3352 1.4989 2.4901 1.6054 13.8675 11.0631 55.0783 10.8032 14.3153 3.7344 0.6803 10.1331 2.3359 2.8316 0.3489 3.4997 18.0646 25.3659 10.1984 15.6302 12.7496 11.4159 5.5664 3.7670 18.6807 8.4114 15.4334 39.5803 227.2562 4.0720 25.9986 47.4555 10.5248 19.9800 17.9336 14.8497 0.5265 66.4700 29.7887 11.6489 25.7221 57.5539 15.9419 15.9720 2.8243 25.4589 27.7499 3.0305
temp: 298.150 k
press: 1.00000 atm
elementType: 8 8 8 6 6 6 6 6 6 6 6 6 6 6 6 6 6 6 1 1 1 1 1 1 1 1 1 1 1 1 1 1 1 1 1 1
symmnumber: 1
zpe: 775251.2 jmol-1
zpe.correction: 0.295278 hartree
zpe.thermalcorrener: 0.311649 hartree
zpe.thermalcorrenthalpy: 0.312593 hartree
zpe.thermalcorrgfe: 0.252327 hartree
zpe.sumelectzpe: -806.664145 hartree
zpe.sumelectthermal: -806.647774 hartree
zpe.sumelectthermalent: -806.646830 hartree
zpe.sumelectthermalfe: -806.707095 hartree
dipole: 2.3323 1.3953 -3.4201
dipole: 4.3684
quadrupole: -107.2364 -110.5429 -105.8769
quadrupole: 10.5908 -9.6952 10.9341
quadrupole: 0.6490 -2.6575 2.0085 10.5908 -9.6952 10.9341
hfenergy: -806.9594225 hartree
pointgroup: C01 [X(C15H18O3)]
dipole: -0.7585023 0.6619563 1.3929637 debye
polarizability: 174.3608186|-21.8317581|155.5868652|0.5598255|-1.3866111|146.6258634 unknown
InChI: InChI=1S/C15H18O3/c1-7-4-5-9-8(2)14(16)17-13(9)12-10(7)6-11-15(12,3)18-11/h9,11-13H,2,4-6H2,1,3H3
charge 0 multiplicity 1
36 atoms
O  3.476184 -0.259601 0.358152
O  -0.534273 -1.697513 -0.634881
O  -1.975148 -1.190139 -2.391996
C  2.227109 -1.134111 0.246969
C  1.003414 -0.35817 0.770745
C  2.747461 -0.434681 -0.968043
C  1.876961 0.760866 -1.307224
C  0.910114 0.894562 -0.121386
C  -0.284716 -1.207496 0.759833
C  -1.587583 -0.447895 1.190852
C  2.431379 -2.599738 0.546274
C  0.079411 1.955535 0.082043
C  -1.336138 0.834024 2.029257
C  -0.928781 2.092749 1.220434
C  -2.335025 -0.249636 -0.119417
C  -1.659596 -1.043614 -1.197227
C  0.048383 3.145311 -0.864684
C  -3.468104 0.454259 -0.363928
H  1.206593 -0.08198 1.82436
H  3.330845 -0.949906 -1.73854
H  1.329183 0.568032 -2.252356
H  2.49341 1.666631 -1.457541
H  -0.135251 -2.117349 1.366994
H  -2.178489 -1.145276 1.818596
H  1.651624 -3.211024 0.056994
H  3.41528 -2.924757 0.168659
H  2.405115 -2.797719 1.6343
H  -0.579721 0.6031 2.802359
H  -2.262254 1.078944 2.585656
H  -0.56449 2.864876 1.932067
H  -1.84697 2.528323 0.774118
H  0.047579 4.096563 -0.297105
H  -0.8801 3.136882 -1.471398
H  0.901683 3.16507 -1.560688
H  -3.991726 1.014674 0.418168
H  -3.892863 0.466799 -1.374314
