program: Gaussian 09
title: 000182271
version: EM64L-G09RevD.01
frameworkgroup: C1[X(C6H15O2PS)]
method: RPBEPBE
basis: SDD
operation: Freq
keyword: #p
keyword: freq=noraman
keyword: PBEPBE/SDD
title: #p freq=noraman PBEPBE/SDD
converged: YES YES NO NO
title: Mulliken charges:
elementType: S P O O C C C C C C H H H H H H H H H H H H H H H
charge: -0.037673 0.735072 -0.523800 -0.525753 -0.636511 -0.259926 -0.232171 -0.610324 -0.652975 -0.654616 0.268393 0.257140 0.229496 0.216537 0.240176 0.192890 0.217194 0.232533 0.216792 0.214820 0.214507 0.232831 0.200912 0.228647 0.235807
chargesum: 0.00000
title: Mulliken charges with hydrogens summed into heavy atoms:
elementType: S P O O C C C C C C
charge: -0.037673 0.735072 -0.523800 -0.525753 -0.110978 0.186108 0.200895 0.056196 0.009183 0.010749
polarizability: 1.54968706e+02 -1.15498811e+01 1.23809982e+02 3.04569015e+00 -2.48650769e+00 9.22385607e+01
1716.lowfreq: -20.0421 -9.4654 -0.0031 -0.0007 0.0023 2.2464 10.6007 30.7784 42.9414
frequency: -15.3863 30.4373 42.7222 47.6210 55.9517 81.8394 92.2718 126.5273 141.0368 206.3682 215.3518 237.4106 254.7924 273.1755 299.1818 323.0482 373.4766 423.3548 444.7088 575.6945 601.3882 641.0543 750.7588 798.7006 813.2652 860.7024 879.6520 982.9360 1019.9399 1028.6218 1035.5595 1065.3512 1087.0565 1103.8717 1127.3464 1140.0385 1243.6464 1253.2115 1261.9908 1268.5146 1347.8697 1353.2225 1387.8936 1390.9170 1393.0697 1446.9192 1456.2492 1460.3314 1463.7468 1467.5647 1475.0438 1478.8313 1481.3681 1489.4017 2965.8977 2974.5944 2976.5008 2981.6039 2992.9080 3023.9063 3057.5640 3059.5701 3065.1873 3078.4402 3079.5581 3089.7123 3094.1028 3103.9341 3108.8198
redmass: 3.2621 3.3351 2.9227 2.5725 1.9520 2.9505 4.8356 3.5520 2.5198 6.2117 1.3531 1.1859 1.2024 3.3721 2.7582 3.4477 3.8173 9.2275 3.9937 9.6022 5.1011 6.3021 1.1557 1.1076 1.0873 2.9377 3.5078 1.7052 2.7481 3.6847 1.3021 2.3705 2.0487 2.1937 1.4057 1.5320 1.2020 1.1573 1.1180 1.2300 1.2150 1.2504 1.2237 1.2108 1.2444 1.0821 1.0402 1.0434 1.0448 1.0578 1.0479 1.0504 1.0647 1.0842 1.0632 1.0366 1.0617 1.0392 1.0366 1.0600 1.0998 1.0990 1.0979 1.1002 1.0983 1.0978 1.1014 1.1047 1.1019
irintensity: 1.2053 3.0386 0.8079 4.1994 0.1509 3.6323 0.0392 1.6281 1.7488 5.5901 1.6555 0.1037 0.8675 3.0888 1.9590 3.3592 1.0629 55.9813 9.3623 91.3042 8.1140 55.7657 7.2484 3.3059 4.0461 93.0903 126.3758 22.8190 178.7683 94.5135 3.7062 2.5011 12.5120 8.1699 5.7279 6.1654 0.4375 1.6504 1.4267 23.9051 18.9897 14.8652 18.8327 23.4482 27.0872 7.9262 11.3677 16.5255 14.9851 1.0966 5.6544 7.2059 10.7436 7.8801 63.1157 31.0860 36.6383 18.7887 30.9924 19.2219 12.0056 2.7647 50.8364 6.9055 53.8534 33.5584 40.2103 24.8517 38.8979
temp: 298.150 k
press: 1.00000 atm
elementType: 16 15 8 8 6 6 6 6 6 6 1 1 1 1 1 1 1 1 1 1 1 1 1 1 1
symmnumber: 1
zpe: 538040.2 jmol-1
zpe.correction: 0.204929 hartree
zpe.thermalcorrener: 0.219493 hartree
zpe.thermalcorrenthalpy: 0.220437 hartree
zpe.thermalcorrgfe: 0.161237 hartree
zpe.sumelectzpe: -1126.527314 hartree
zpe.sumelectthermal: -1126.512750 hartree
zpe.sumelectthermalent: -1126.511806 hartree
zpe.sumelectthermalfe: -1126.571006 hartree
dipole: 1.2858 2.0103 -1.8966
dipole: 3.0482
quadrupole: -66.5832 -75.7112 -78.5920
quadrupole: -1.7580 0.2671 3.1185
quadrupole: 7.0456 -2.0824 -4.9632 -1.7580 0.2671 3.1185
hfenergy: -1126.732243 hartree
pointgroup: C01 [X(C6H15O2P1S1)]
dipole: 0.2326575 -0.8501023 -0.8132972 debye
dipolederiv: -0.8260338 -0.0597283 0.0076223 -0.0152123 -0.2451233 0.0046438 0.3034638 -0.0324524 -0.24708 1.3687955 -0.1166197 0.0343793 0.275039 1.2863897 -0.078499 0.2609755 -0.1700377 0.4535916 -0.6358302 0.2870012 -0.0277184 0.3129775 -1.326248 0.0219153 -0.255307 0.4442394 -0.4631251 -1.1324166 -0.7107407 -0.1030639 -0.6524538 -0.9945621 0.0369301 -0.4199782 -0.2390277 -0.3620153 0.3023626 0.114641 0.122408 0.1547335 0.1527135 0.0693891 0.3009946 0.1021308 0.1760425 0.2230396 0.1223397 -0.0457987 -0.290223 0.9826032 -0.0306348 -0.0465261 0.0235382 0.2978298 1.0155984 0.6540535 0.0263911 0.2010191 0.3795095 -0.0256474 0.0123669 -0.0846915 0.3469597 0.0017275 -0.0557496 -0.0202103 -0.0217008 -0.0985403 -0.0165849 -0.1154734 -0.0741426 -0.0000183 0.0667704 -0.0165323 0.0349848 0.045363 -0.1297127 -0.0965737 0.0513826 -0.1539139 -0.1040436 -0.0441253 -0.1539633 -0.0257088 -0.0623527 -0.0943384 -0.0678269 -0.0045861 -0.0570256 0.0269205 -0.1158582 0.0669712 -0.0065699 0.01592 0.0252994 -0.0410767 -0.0273925 -0.0530448 0.0650261 0.0655864 -0.0685329 0.0367646 -0.0687507 -0.0129984 0.0384763 -0.0638846 0.0653457 -0.093349 0.0228436 0.0447833 -0.1149007 0.0634659 -0.0683399 0.050439 -0.0926332 0.0537448 -0.0595175 -0.0762487 -0.1031773 0.1052242 0.0327333 -0.0293611 -0.0214369 0.0585052 -0.0255268 0.0345408 -0.0615714 -0.0277374 -0.0391947 0.0923083 -0.0302246 0.0617365 -0.0630711 0.0564041 0.0169147 -0.0823146 -0.084721 0.0401406 0.0018842 0.0379563 -0.0479423 0.143866 0.0038434 -0.1786643 -0.0969415 0.1081691 0.074622 0.0609135 0.0360051 -0.0130353 0.0791915 -0.0146132 0.0772605 0.0956474 -0.0240167 0.0434738 -0.0101215 0.0249758 0.0533541 0.0969842 0.1166882 -0.058887 -0.0488885 -0.063674 -0.1459261 -0.1009323 0.0246631 -0.0681443 -0.1806072 -0.0725807 -0.0341874 0.1018282 -0.0430331 0.0157359 -0.0054763 -0.1916076 0.0305021 0.0165422 0.0386635 0.0848713 -0.0179907 0.0603995 -0.1159189 0.0516936 0.0751109 0.0732818 -0.1004177 0.0402382 -0.0506369 -0.1175339 0.0121208 0.0823694 -0.0559005 0.1104198 0.0091282 0.056047 -0.0176849 0.053552 -0.1768145 -0.1011363 -0.0074836 -0.083977 0.0246476 -0.0174096 -0.0064098 -0.0234363 0.1069641 0.0689477 0.1229811 -0.0605015 0.0591313 -0.0299318 0.067973 -0.0648176 0.0990636 0.0195959 0.0994206 0.0359021 0.0888797 -0.0000813 0.0906944 0.0070426 0.060785 -0.0257218 -0.1085452 unknown
polarizability: 152.5224638|14.1001249|125.8659883|3.5583317|4.5545321|92.6287963 unknown
InChI: InChI=1S/C4H10O2P.C2H5S/c1-3-5-7-6-4-2;1-2-3/h3-4H2,1-2H3;2H2,1H3
charge 0 multiplicity 1
25 atoms
S  -1.942059 0.542963 0.895926
P  0.050581 0.515263 -0.331922
O  1.099652 -0.515955 0.676688
O  0.678709 2.028989 0.298379
C  -3.115552 0.070624 -0.533302
C  0.749038 -1.939687 0.864983
C  2.148931 2.276784 0.258061
C  -3.233769 -1.44501 -0.740103
C  0.998995 -2.785915 -0.392216
C  2.355348 3.669623 0.848597
H  -4.080713 0.519211 -0.242987
H  -2.763129 0.583978 -1.444461
H  1.401474 -2.265831 1.69283
H  -0.306399 -2.010285 1.199137
H  2.659144 1.497257 0.851196
H  2.507187 2.225591 -0.791365
H  -2.265973 -1.883241 -1.045746
H  -3.556148 -1.946747 0.189073
H  -3.975932 -1.67175 -1.530326
H  0.821531 -3.855271 -0.171139
H  0.329686 -2.493375 -1.222314
H  2.042615 -2.672551 -0.734014
H  3.431886 3.924065 0.85495
H  1.815788 4.428608 0.256953
H  1.979008 3.704762 1.884924
