program: Gaussian 09
title: 000182266
version: EM64L-G09RevD.01
frameworkgroup: C1[X(C21H19NO5)]
method: RPBEPBE
basis: SDD
operation: Freq
keyword: #p
keyword: freq=noraman
keyword: PBEPBE/SDD
title: #p freq=noraman PBEPBE/SDD
converged: YES YES NO NO
title: Mulliken charges:
elementType: O O O O O N C C C C C C C C C C C C C C C C C C C C C H H H H H H H H H H H H H H H H H H H
charge: -0.275825 -0.211617 -0.257935 -0.268682 -0.183047 -0.074798 0.135159 0.132384 0.333570 0.438685 0.545813 0.066051 -0.021755 -0.615822 -0.460512 0.000973 0.185938 -0.648158 -0.533680 -0.611815 0.161530 -0.372214 0.057239 -0.206888 -0.622246 -0.617106 -0.491560 0.218563 0.251609 0.248173 0.269502 0.242107 0.269544 0.203950 0.231129 0.247071 0.246947 0.229681 0.185514 0.224672 0.228835 0.222901 0.188521 0.225466 0.241918 0.240219
chargesum: 0.00000
title: Mulliken charges with hydrogens summed into heavy atoms:
elementType: O O O O O N C C C C C C C C C C C C C C C C C C C C C
charge: -0.275825 -0.211617 -0.257935 -0.268682 -0.183047 -0.074798 0.135159 0.132384 0.333570 0.438685 0.545813 0.066051 -0.021755 -0.145651 -0.212339 0.000973 0.185938 -0.378656 -0.291573 -0.342271 0.161530 0.062865 0.057239 0.287130 0.017621 0.023150 0.216043
polarizability: 4.21240400e+02 2.76513994e+01 3.09660183e+02 -2.05263562e+01 8.08686791e+00 1.32872849e+02
1716.lowfreq: -19.5226 -2.8723 -0.0007 -0.0004 0.0005 4.0461 8.1146 29.1971 31.0508
frequency: -19.2513 29.1950 31.0285 36.1853 37.2952 55.2550 86.4201 109.2995 115.6332 136.0231 157.2078 173.4852 188.1569 199.5155 208.2743 216.1824 223.4980 241.8464 254.3505 270.1736 308.3373 314.8239 319.5120 333.1614 344.4091 375.5537 383.1993 410.5877 421.9154 429.9855 455.1191 462.9207 475.6363 501.5433 542.8107 546.9616 575.4057 602.8843 610.7180 656.4165 668.0501 674.1029 694.0793 694.7746 718.6426 750.6831 770.2195 782.2213 792.2454 795.4757 816.8829 829.0719 846.8189 851.8873 877.6566 895.5262 898.1401 940.1407 968.3039 974.3636 1000.8109 1012.6363 1025.6231 1031.2378 1037.9630 1055.1692 1063.6471 1088.3786 1089.4386 1104.9963 1106.0630 1119.8319 1127.6615 1146.9280 1157.8196 1169.4153 1175.8662 1197.5305 1211.8244 1235.8478 1262.5886 1264.2084 1281.2172 1287.4667 1304.0264 1320.5810 1363.1936 1366.8028 1379.1456 1392.5550 1403.7497 1418.2255 1423.5069 1436.0646 1442.3859 1452.4478 1453.1895 1458.7109 1461.4447 1462.4819 1464.5743 1476.4506 1476.7645 1483.5814 1484.0192 1492.8856 1502.1011 1519.6778 1590.3721 1609.0847 1619.2799 1629.4120 1666.1893 2838.1532 2842.0769 2863.3991 3000.1277 3005.6285 3020.1672 3023.9092 3024.3759 3028.5994 3064.8506 3078.7206 3084.1347 3106.3591 3115.8814 3131.2779 3131.8770 3152.7961 3159.9545 3172.2867
redmass: 3.0140 4.2047 3.0802 2.6069 3.5422 7.4959 4.4299 2.5744 8.3312 5.4681 4.8301 6.3037 2.9761 2.1980 1.7716 2.1262 1.6898 1.4223 2.7741 3.0688 4.7118 4.7636 3.5527 5.9747 4.0663 6.9300 4.6685 4.5371 3.9312 2.7967 5.0377 5.0728 6.8985 7.5997 6.0176 5.1973 4.9299 4.2381 6.7063 7.0567 7.6513 7.4851 8.6344 4.9434 5.8213 5.4033 7.0513 5.2991 5.4592 1.3151 2.1647 2.5567 9.0304 6.4086 9.6153 1.6092 1.5508 6.8003 1.3683 6.2373 4.9868 2.9881 6.3294 1.5320 1.9875 2.4694 1.4540 2.7912 1.5395 1.2551 5.2512 1.0373 1.3809 1.9428 1.5830 1.5162 2.2224 1.9308 1.5392 1.7594 2.4610 2.8584 3.8382 1.3999 1.3323 4.9060 1.3677 1.3240 5.6364 2.5200 3.3886 1.1469 3.5634 4.5417 1.1655 1.5568 5.4734 1.0524 1.1213 1.0485 1.0854 1.0549 1.0851 1.1758 1.0626 1.1054 6.5773 4.7411 9.2735 8.3104 7.8095 8.1871 12.9064 1.0652 1.0608 1.0587 1.0622 1.0285 1.0725 1.0843 1.0536 1.0725 1.1013 1.1010 1.1004 1.1190 1.1052 1.1055 1.0875 1.0913 1.0962 1.0932
irintensity: 8.6022 1.3287 0.9383 12.4381 0.1322 1.1403 0.5315 1.1332 0.3096 0.0882 0.4978 0.5731 2.6563 0.6583 0.3511 4.4652 3.1512 0.6747 1.8765 0.0771 2.3903 4.2004 5.7120 1.7397 3.6842 1.7305 1.0777 4.9549 2.4843 0.8476 10.4747 0.8627 5.6227 2.0253 4.9048 0.5814 5.5195 0.5267 6.3016 1.4447 0.3827 2.7625 0.0345 0.0852 1.1882 6.1177 3.3449 40.3937 3.5891 6.4392 12.2397 4.1674 36.9936 13.6403 99.9533 36.2384 37.5515 22.0842 1.9030 270.8645 4.1406 4.2469 10.8133 10.7417 36.9221 86.5702 4.1704 86.6693 20.2206 0.0225 21.1412 0.0012 11.2485 7.9526 9.0975 0.7773 41.8766 155.2092 41.6489 10.7553 7.8255 72.6328 346.5396 17.0147 20.1567 33.1699 5.0266 10.3772 30.4989 103.6525 89.7539 0.9426 7.0698 43.7524 1.5302 7.5328 183.8485 13.6814 47.9661 14.9217 8.2297 24.6670 11.5757 5.5703 13.7039 22.4041 23.6984 22.8228 127.1752 56.7852 35.3331 2.5879 372.9711 72.7654 88.7163 187.6665 20.9319 59.6981 49.5208 35.3256 134.8550 38.5520 17.8372 26.9342 63.6584 23.5849 28.6169 31.9051 1.1968 4.9141 23.7078 3.0003
temp: 298.150 k
press: 1.00000 atm
elementType: 8 8 8 8 8 7 6 6 6 6 6 6 6 6 6 6 6 6 6 6 6 6 6 6 6 6 6 1 1 1 1 1 1 1 1 1 1 1 1 1 1 1 1 1 1 1
symmnumber: 1
zpe: 931483.4 jmol-1
zpe.correction: 0.354783 hartree
zpe.thermalcorrener: 0.377964 hartree
zpe.thermalcorrenthalpy: 0.378908 hartree
zpe.thermalcorrgfe: 0.301396 hartree
zpe.sumelectzpe: -1240.555032 hartree
zpe.sumelectthermal: -1240.531851 hartree
zpe.sumelectthermalent: -1240.530907 hartree
zpe.sumelectthermalfe: -1240.608420 hartree
dipole: 1.1805 -3.8920 0.1991
dipole: 4.0719
quadrupole: -144.5449 -149.9537 -156.9886
quadrupole: 6.5925 2.8400 0.0327
quadrupole: 5.9509 0.5420 -6.4929 6.5925 2.8400 0.0327
hfenergy: -1240.9098156 hartree
pointgroup: C01 [X(C21H19N1O5)]
dipole: -0.3343692 1.5667154 0.0087646 debye
polarizability: 424.5701362|18.9445723|304.7007007|22.5750522|-16.7396133|134.5025944 unknown
InChI: InChI=1S/C21H19NO5/c1-22(2)7-6-11-8-14(24-3)20-17-13(11)5-4-12-9-15-19(26-10-25-15)18(16(12)17)21(23)27-20/h4-5,8-9H,6-7,10H2,1-3H3
charge 0 multiplicity 1
46 atoms
O  1.067542 -2.44953 0.347168
O  4.844764 -0.085168 0.585395
O  4.869882 2.293399 0.265032
O  -1.532729 -3.846863 0.135013
O  3.322682 -2.552248 0.701103
N  -5.851336 1.498225 0.366222
C  -0.116037 -0.333062 -0.118985
C  1.139461 0.374626 -0.028418
C  -1.340618 0.374095 -0.395252
C  -2.570552 -0.368723 -0.477823
C  1.166735 1.802108 -0.219841
C  2.35733 -0.3576 0.252645
C  -0.127905 -1.747028 0.069692
C  -3.907672 0.311564 -0.72717
C  -1.270607 1.803199 -0.580923
C  3.546363 0.382016 0.328495
C  -1.33554 -2.476879 -0.015406
C  -2.534287 -1.756548 -0.292109
C  -0.069527 2.489284 -0.499737
C  2.407751 2.51591 -0.132746
C  3.555502 1.789385 0.137555
C  -4.494218 0.942739 0.566507
C  2.350566 -1.815347 0.451832
C  5.727559 1.116443 0.554451
C  -5.868491 2.715987 -0.46818
C  -6.564343 1.700394 1.644924
C  -0.423565 -4.7888 0.395174
H  -3.808687 1.082971 -1.513363
H  -4.643696 -0.424206 -1.095958
H  -2.190689 2.354586 -0.795858
H  -3.453145 -2.348589 -0.356021
H  -0.040524 3.574352 -0.648311
H  2.441457 3.599133 -0.275496
H  -3.782219 1.712399 0.964288
H  -4.562497 0.148134 1.332915
H  6.463365 0.992959 -0.257575
H  6.191701 1.238904 1.547272
H  -5.459046 2.504626 -1.470869
H  -5.28204 3.561524 -0.022558
H  -6.910687 3.05679 -0.600506
H  -6.604939 0.74805 2.202772
H  -7.602177 2.022029 1.4441
H  -6.087661 2.468797 2.305799
H  -0.918621 -5.770796 0.440137
H  0.077446 -4.56203 1.349802
H  0.318951 -4.765111 -0.418591
