program: Gaussian 09
title: 000182261
version: EM64L-G09RevD.01
frameworkgroup: C1[X(C15H16O3)]
method: RPBEPBE
basis: SDD
operation: Freq
keyword: #pfreq=noraman
keyword: PBEPBE/SDD
title: #p freq=noraman PBEPBE/SDD
converged: YES YES NO NO
title: Mulliken charges:
elementType: O O O C C C C C C C C C C C C C C C H H H H H H H H H H H H H H H H
charge: -0.213994 -0.196236 -0.225719 -0.187131 -0.069201 -0.205765 -0.594132 -0.344877 0.354764 0.192045 0.236536 -0.010319 -0.735344 0.316320 -0.023884 -0.849148 -0.522541 -0.830184 0.233830 0.233868 0.258450 0.230870 0.234763 0.238304 0.210909 0.253515 0.239076 0.224120 0.249357 0.308204 0.270449 0.237173 0.249203 0.236720
chargesum: 0.00000
title: Mulliken charges with hydrogens summed into heavy atoms:
elementType: O O O C C C C C C C C C C C C C C C
charge: -0.213994 -0.196236 -0.225719 0.046699 0.164667 0.052685 -0.128498 -0.106573 0.354764 0.192045 0.236536 -0.010319 -0.031844 0.316320 -0.023884 -0.067468 -0.252092 -0.107088
polarizability: 1.98734260e+02 -1.00141924e+01 1.89007741e+02 2.14433632e+01 1.14985195e+00 1.28549814e+02
1716.lowfreq: -12.3088 -8.3853 -5.0049 -0.0004 -0.0004 0.0003 32.3511 49.2698 86.3864
frequency: 32.2384 49.2471 86.3813 94.0190 140.3982 144.7680 167.1041 177.7778 204.5883 210.7228 226.9222 239.5032 255.3697 292.6657 308.7165 322.1005 370.1433 391.6489 424.1955 459.8016 482.6344 497.9381 525.2061 563.5906 583.9831 592.1442 611.1159 657.2628 679.4518 712.3662 728.2300 756.9279 792.3709 812.4583 839.5525 871.3565 884.1245 903.4647 932.9585 942.5213 967.2175 993.6178 1007.4115 1016.1983 1038.6966 1041.0608 1048.4470 1067.5356 1083.6527 1117.9742 1142.2706 1154.1740 1183.4137 1187.4601 1199.5800 1235.6026 1239.1324 1266.6403 1297.5929 1300.4787 1312.4417 1333.9905 1362.8154 1373.4196 1385.3246 1390.2806 1393.6020 1400.9636 1445.5534 1452.5259 1464.2780 1465.5294 1469.6504 1481.5390 1482.7769 1593.0271 1602.5359 1660.9192 1673.7130 1706.3574 2955.7232 2960.0034 2965.5950 2974.0570 2975.1302 2993.4537 2994.6257 3029.0765 3047.3014 3049.0254 3091.1864 3094.2916 3097.4579 3100.9710 3116.5100 3193.2095
redmass: 4.7419 7.7775 3.7284 3.2548 6.5624 1.4030 1.2596 1.7432 2.1919 1.4165 4.9198 2.1434 3.4940 2.7785 4.5538 3.0927 3.8570 4.6517 4.5009 3.6158 4.2596 3.7823 4.5899 4.1430 6.8169 5.0345 4.8876 4.1195 4.2870 3.9096 4.4937 3.6030 3.5332 2.7945 3.1064 1.8964 1.6644 2.1706 2.2558 2.8484 2.8946 1.7477 1.5275 2.7263 1.8298 1.5939 1.9904 2.6792 2.4689 1.8356 2.3085 2.2856 1.5863 2.2733 1.5263 2.3797 1.8537 1.4055 1.5403 1.8761 1.5455 2.8889 1.7092 1.4740 1.1988 1.3494 1.2308 1.3558 1.1054 1.0843 1.0852 1.0482 1.0449 1.0507 1.0505 8.3892 6.4998 8.5370 8.1921 12.2961 1.0810 1.0403 1.0669 1.0387 1.0824 1.0591 1.0612 1.0951 1.0963 1.0940 1.1002 1.0907 1.0966 1.0968 1.0980 1.0976
irintensity: 1.0541 2.3624 5.3573 0.3484 0.4906 0.0242 0.2314 1.2593 1.1939 1.2085 0.8285 1.7843 2.7701 0.7023 7.4415 1.8028 1.0311 1.1150 1.2323 1.6421 6.1910 0.7862 1.2775 2.0630 6.6020 2.1535 9.0670 7.4851 1.0848 5.1736 5.6169 3.3088 1.8507 12.0077 22.3050 3.4094 11.5629 62.5417 10.2110 17.0249 6.1090 1.7564 8.9207 58.7893 11.7789 4.6227 56.9273 24.8163 9.5443 48.6930 42.4041 9.7783 3.9508 39.4797 8.4227 9.6899 22.7464 1.8896 5.5929 7.7121 42.9795 5.7899 0.8722 10.3221 52.5466 0.7606 32.4968 10.3192 44.3519 15.7783 12.3661 15.0629 10.4806 12.4630 9.0892 239.0377 46.1612 7.1842 131.1915 288.6068 17.8419 19.6340 9.3836 14.6814 18.7545 40.9692 41.5663 15.0693 14.6182 28.2120 18.0226 15.0025 26.6298 16.3925 4.6934 4.6389
temp: 298.150 k
press: 1.00000 atm
elementType: 8 8 8 6 6 6 6 6 6 6 6 6 6 6 6 6 6 6 1 1 1 1 1 1 1 1 1 1 1 1 1 1 1 1
symmnumber: 1
zpe: 715635.9 jmol-1
zpe.correction: 0.272571 hartree
zpe.thermalcorrener: 0.289152 hartree
zpe.thermalcorrenthalpy: 0.290096 hartree
zpe.thermalcorrgfe: 0.228784 hartree
zpe.sumelectzpe: -805.535745 hartree
zpe.sumelectthermal: -805.519165 hartree
zpe.sumelectthermalent: -805.518220 hartree
zpe.sumelectthermalfe: -805.579533 hartree
dipole: -2.7166 2.9849 -6.5904
dipole: 7.7280
quadrupole: -117.1587 -93.3693 -112.8427
quadrupole: 2.4416 7.3708 7.1206
quadrupole: -9.3685 14.4210 -5.0525 2.4416 7.3708 7.1206
hfenergy: -805.8083163 hartree
pointgroup: C01 [X(C15H16O3)]
dipole: -1.001934 -1.1603914 2.6256243 debye
polarizability: 197.6000166|9.9015516|189.7921288|-22.2134569|-1.0570452|128.8996696 unknown
InChI: InChI=1S/C15H16O3/c1-7-4-12(16)14-8(2)5-13-11(6-10(7)14)9(3)15(17)18-13/h4,6,9,11,13H,5H2,1-3H3
charge 0 multiplicity 1
34 atoms
O  -1.795098 1.483237 -0.466303
O  -2.977322 0.335376 -2.107645
O  3.524399 0.90841 -1.186572
C  -1.658387 -0.249647 1.230146
C  -1.517787 1.277059 0.995721
C  -2.82605 -0.581028 0.223524
C  -0.199192 1.971707 1.354703
C  -0.444713 -1.119551 1.001474
C  0.987757 1.736041 0.426299
C  -2.577024 0.403685 -0.936399
C  0.794539 -0.822373 0.494718
C  1.407399 0.472261 0.092184
C  -3.001075 -2.028412 -0.261141
C  1.778246 -1.894893 0.154428
C  2.699874 0.126079 -0.620035
C  1.686424 2.993521 -0.034426
C  2.856557 -1.343616 -0.49824
C  1.569069 -3.355248 0.449635
H  -2.01928 -0.423008 2.263519
H  -2.342994 1.7825 1.538349
H  -3.774171 -0.247674 0.699763
H  0.073138 1.644634 2.380944
H  -0.38746 3.058763 1.410287
H  -0.6388 -2.179543 1.219635
H  -3.234312 -2.70623 0.579476
H  -3.82925 -2.075362 -0.988708
H  -2.092444 -2.39298 -0.76947
H  1.906697 3.65443 0.82737
H  1.003379 3.561874 -0.698296
H  2.612754 2.777069 -0.585235
H  3.721957 -1.876385 -0.897082
H  1.412945 -3.52914 1.531525
H  2.437386 -3.952761 0.128518
H  0.67534 -3.747891 -0.072969
