program: Gaussian 09
title: 000182253
version: EM64L-G09RevD.01
frameworkgroup: C1[X(C15H12O3)]
method: RPBEPBE
basis: SDD
operation: Freq
keyword: #pfreq=noraman
keyword: PBEPBE/SDD
title: #p freq=noraman PBEPBE/SDD
converged: YES YES NO NO
title: Mulliken charges:
elementType: O O O C C C C C C C C C C C C C C C H H H H H H H H H H H H
charge: -0.220543 -0.439325 -0.243593 0.297088 0.312415 0.004874 0.433115 -0.358813 -0.356200 -0.392325 -0.383826 -0.364849 -0.356696 0.251147 -0.334064 -0.355662 -0.802753 0.112018 0.264385 0.272205 0.272971 0.276581 0.235888 0.236273 0.277403 0.275020 0.230421 0.240592 0.229228 0.387025
chargesum: 0.00000
title: Mulliken charges with hydrogens summed into heavy atoms:
elementType: O O O C C C C C C C C C C C C C C C
charge: -0.220543 -0.052300 -0.243593 0.297088 0.312415 0.004874 0.433115 -0.094428 -0.083995 -0.156437 -0.147552 -0.091878 -0.080115 0.251147 -0.056661 -0.080642 -0.102512 0.112018
polarizability: 2.88392128e+02 5.38133791e+00 1.69179534e+02 1.41304493e+01 1.78688315e+00 9.12860637e+01
1716.lowfreq: -31.2663 -0.0008 -0.0007 -0.0005 3.8244 4.1065 9.8955 34.6673 47.3569
frequency: -31.0930 34.6417 47.3343 54.9880 82.0772 92.3474 128.6073 157.4754 210.3642 228.3555 248.6768 285.5522 336.7325 343.1588 403.5833 414.3666 434.3736 447.0818 468.0692 496.5640 550.3352 593.2752 594.3122 627.1613 632.6350 645.4530 674.2034 700.4618 737.9849 754.8327 782.4772 795.1052 843.0500 857.8325 871.0966 885.2723 919.0090 974.5410 987.5276 990.4723 997.7949 1002.8371 1006.0962 1013.5003 1026.2630 1046.6024 1117.6296 1126.3001 1144.9484 1154.8644 1191.0435 1198.0409 1225.9277 1283.0968 1303.4532 1311.6956 1322.9996 1369.4019 1378.6925 1397.5539 1408.4665 1410.6376 1467.5844 1472.0650 1491.4824 1502.0403 1531.1907 1568.0812 1579.9134 1616.5220 1618.9607 1643.8736 2977.2322 3059.4665 3090.4004 3125.4252 3128.9982 3150.0795 3152.2054 3154.5865 3159.5174 3170.3821 3178.8612 3531.9189
redmass: 1.0172 5.9041 5.3690 5.2354 5.0903 6.1233 5.0149 6.9073 5.7826 5.3821 6.4593 4.8940 7.7072 2.8733 2.8348 2.9322 4.4276 4.6504 4.9113 3.9653 4.0796 2.1420 2.0515 6.8552 6.2772 5.0966 3.9893 3.2942 2.9532 5.7053 3.4136 5.3167 1.5970 1.2951 1.2629 1.8566 5.2769 1.3418 1.3928 1.4030 1.3501 3.9514 1.4795 2.8842 2.6497 1.5882 1.3718 1.3114 2.5770 2.0749 1.1446 1.1787 2.9674 3.5672 1.3667 1.3149 2.6510 4.8718 6.0016 1.2216 3.8331 3.5661 1.1086 1.0567 2.5430 2.6596 9.3743 6.8435 7.1884 6.2529 6.3582 8.7378 1.0392 1.0942 1.1000 1.0885 1.0889 1.0912 1.0884 1.0930 1.0961 1.0968 1.0962 1.0642
irintensity: 0.5229 0.0371 0.3743 0.3292 1.0852 2.4420 0.2250 1.5616 1.0603 5.2719 2.8720 3.1422 1.0711 2.2714 1.2010 0.1486 28.5284 11.7245 24.5460 5.0838 19.7211 34.7789 63.3535 0.1938 7.4756 17.7271 12.8148 92.4480 42.5326 13.7929 12.4586 2.3290 20.1494 7.9343 3.0863 45.4191 65.5940 1.2577 0.4613 9.2322 1.8896 172.1198 22.1263 4.2713 113.1304 22.2955 8.9552 9.6492 56.9233 62.9144 49.5334 6.8920 2.0666 384.9273 41.1197 9.7734 66.8066 9.5662 0.1797 14.6173 23.7164 12.4426 13.8993 13.7533 15.2732 3.5499 131.3316 34.7958 44.2137 41.0766 46.0442 301.3564 25.5942 21.3488 15.4725 13.0457 18.4852 11.2769 0.0134 8.6723 4.2471 2.4004 0.8901 52.4902
temp: 298.150 k
press: 1.00000 atm
elementType: 8 8 8 6 6 6 6 6 6 6 6 6 6 6 6 6 6 6 1 1 1 1 1 1 1 1 1 1 1 1
symmnumber: 1
zpe: 598970.3 jmol-1
zpe.correction: 0.228136 hartree
zpe.thermalcorrener: 0.243101 hartree
zpe.thermalcorrenthalpy: 0.244045 hartree
zpe.thermalcorrgfe: 0.184595 hartree
zpe.sumelectzpe: -803.235346 hartree
zpe.sumelectthermal: -803.220380 hartree
zpe.sumelectthermalent: -803.219436 hartree
zpe.sumelectthermalfe: -803.278886 hartree
dipole: -2.8101 -4.3636 -0.3695
dipole: 5.2033
quadrupole: -92.5655 -104.3876 -104.8822
quadrupole: -1.2172 -2.1730 0.5276
quadrupole: 8.0463 -3.7759 -4.2704 -1.2172 -2.1730 0.5276
hfenergy: -803.4634816 hartree
pointgroup: C01 [X(C15H12O3)]
dipole: -1.1473153 1.6191088 -0.502852 debye
polarizability: 285.6033431|-13.1174211|156.7504493|-24.8261385|-27.6464634|106.5039335 unknown
InChI: InChI=1S/C15H12O3/c1-10-2-4-11(5-3-10)14(16)12-6-8-13(9-7-12)15(17)18/h2-9,17H,1H3
charge 0 multiplicity 1
30 atoms
O  -0.741932 -2.310361 1.438216
O  4.773421 2.078333 -0.65436
O  5.602308 -0.079334 -0.878855
C  -1.946314 -0.457348 0.486064
C  0.65607 -0.664593 0.391803
C  -0.689386 -1.207229 0.806614
C  -4.436553 0.82979 -0.09972
C  -2.064041 0.420205 -0.626193
C  -3.095065 -0.697967 1.288412
C  -3.294378 1.045633 -0.914656
C  -4.314426 -0.05807 1.004332
C  0.934469 0.727741 0.32973
C  1.701984 -1.594021 0.139422
C  3.258568 0.248273 -0.267686
C  2.228684 1.182911 0.00863
C  2.989146 -1.144966 -0.198501
C  -5.746364 1.537856 -0.389732
C  4.637232 0.680567 -0.624272
H  -1.207563 0.582345 -1.288934
H  -3.005469 -1.399082 2.124894
H  0.148044 1.452034 0.563543
H  1.47976 -2.662434 0.223341
H  -3.374092 1.704649 -1.78742
H  -5.188303 -0.248352 1.638745
H  2.453386 2.252217 -0.028124
H  3.801111 -1.84879 -0.407563
H  -6.612965 0.940421 -0.056984
H  -5.794255 2.508741 0.141251
H  -5.865001 1.747812 -1.467012
H  5.712425 2.302116 -0.894083
