program: Gaussian 09
title: 000182251
version: EM64L-G09RevD.01
frameworkgroup: C1[X(C16H14O5)]
method: RPBEPBE
basis: SDD
operation: Freq
keyword: #pfreq=noraman
keyword: PBEPBE/SDD
title: #p freq=noraman PBEPBE/SDD
converged: YES YES NO NO
title: Mulliken charges:
elementType: O O O O O C C C C C C C C C C C C C C C C H H H H H H H H H H H H H H
charge: -0.320013 -0.246793 -0.203140 -0.286240 -0.224087 0.387652 -0.119990 -0.325117 -0.761801 -0.746881 0.137979 0.029263 0.049468 0.313009 0.505643 -0.654778 -0.375762 -0.265353 -0.157447 -0.308144 0.147359 0.236485 0.237010 0.256078 0.228150 0.255454 0.220623 0.226331 0.219096 0.242969 0.259493 0.269715 0.248777 0.269081 0.255910
chargesum: 0.00000
title: Mulliken charges with hydrogens summed into heavy atoms:
elementType: O O O O O C C C C C C C C C C C C C C C C
charge: -0.320013 -0.246793 -0.203140 -0.286240 -0.224087 0.387652 0.116495 0.167971 -0.057574 -0.058485 0.137979 0.029263 0.049468 0.313009 0.505643 -0.395285 -0.106047 -0.016575 0.111634 -0.052234 0.147359
polarizability: 2.78547712e+02 -3.61902878e+01 2.16732113e+02 1.57091689e+01 7.03802425e+00 1.01298264e+02
1716.lowfreq: -8.3786 -7.5019 -5.7256 -0.0005 -0.0004 0.0002 5.1762 34.3254 47.4766
frequency: -7.1525 34.3127 47.4621 66.2192 117.9870 127.4440 134.3909 157.1881 178.8525 184.7533 206.9013 218.0860 235.1798 271.1501 283.9171 342.2069 355.0138 371.8024 378.5956 397.5009 406.5645 412.5667 430.5108 466.0202 497.8910 530.4931 543.4289 555.9445 586.0470 625.5665 631.9346 638.1748 700.8103 717.7529 738.9997 756.3025 765.2078 767.4058 804.8847 821.0798 843.6480 848.7074 861.0130 882.6204 900.8209 933.1901 943.7746 956.3006 988.0823 988.8155 992.9754 1026.8976 1044.1621 1065.1742 1080.8288 1101.4287 1114.5422 1119.4555 1122.5350 1171.3143 1201.0485 1230.5246 1236.8041 1251.4629 1276.9078 1301.9319 1329.0674 1344.6304 1386.3843 1388.6887 1396.4617 1409.4793 1421.5024 1426.5874 1450.2606 1456.3235 1458.3528 1465.4483 1480.6595 1491.2526 1528.3852 1576.0148 1606.5227 1622.2374 1674.1890 2982.1256 2985.8893 3041.7973 3074.5124 3076.8393 3080.1925 3091.4419 3094.9234 3115.1546 3135.3170 3157.3696 3190.1798 3226.6414 3269.4277
redmass: 5.7652 3.5941 4.9646 7.8561 5.1187 4.5543 5.2450 2.6291 5.6593 1.2521 1.9306 5.7938 2.0666 2.3308 4.6701 3.2739 3.4643 7.0310 4.4410 5.0796 3.6604 4.0652 4.4369 3.8926 4.9528 6.7410 4.5654 5.6039 4.1294 5.2075 7.5746 4.5748 5.0548 7.0388 3.5518 4.0577 6.5756 1.4633 7.3200 1.4734 4.4593 4.8023 1.3899 1.5943 5.7772 3.5151 1.5610 1.7289 1.3312 1.6498 2.4185 2.0181 3.6077 1.8948 3.0981 3.6242 2.1329 1.5077 2.0247 2.0528 1.5130 1.9049 1.1949 2.1146 1.7669 1.4556 1.9854 1.8541 1.3556 2.4166 1.2450 5.5953 2.6418 5.3197 2.7465 1.2830 1.1155 1.0552 1.0669 1.2377 5.2895 9.9168 7.5439 8.3535 10.3860 1.0356 1.0359 1.0580 1.0971 1.0910 1.0989 1.0999 1.0996 1.1080 1.0906 1.0931 1.0955 1.0930 1.1075
irintensity: 4.1892 2.1142 0.6782 1.2861 5.2061 2.1429 0.4884 0.1665 3.1871 0.3166 0.8735 0.3838 0.6542 6.7467 1.2920 0.9831 5.8120 2.0186 4.0446 5.0751 0.0432 10.2048 4.3166 2.4267 3.9066 2.9325 12.6024 6.3428 0.4273 9.5457 13.6819 1.1487 0.1017 37.5463 30.1679 23.4229 5.2545 44.0977 3.7857 4.4510 4.5689 13.4809 17.1713 66.1220 32.2965 78.4181 6.0268 8.7985 0.8212 4.2940 21.1752 4.9351 48.7872 13.8136 63.1190 123.2680 38.0753 79.9449 10.2189 36.6587 3.9165 0.3066 19.1619 10.1978 6.1149 19.6936 79.8941 12.0746 52.6831 54.6843 34.9810 74.6058 32.5141 40.1803 23.0970 23.9242 9.3901 2.3242 14.8783 4.8245 1.1662 168.8387 24.2501 49.0865 520.1363 19.5034 19.7300 18.5624 1.7390 26.5225 35.9766 22.8474 26.5588 6.5717 9.2738 3.1645 2.1898 2.7111 0.2648
temp: 298.150 k
press: 1.00000 atm
elementType: 8 8 8 8 8 6 6 6 6 6 6 6 6 6 6 6 6 6 6 6 6 1 1 1 1 1 1 1 1 1 1 1 1 1 1
symmnumber: 1
zpe: 690399.5 jmol-1
zpe.correction: 0.262959 hartree
zpe.thermalcorrener: 0.280621 hartree
zpe.thermalcorrenthalpy: 0.281565 hartree
zpe.thermalcorrgfe: 0.217771 hartree
zpe.sumelectzpe: -992.648328 hartree
zpe.sumelectthermal: -992.630666 hartree
zpe.sumelectthermalent: -992.629722 hartree
zpe.sumelectthermalfe: -992.693516 hartree
dipole: 5.4012 3.5531 0.1293
dipole: 6.4663
quadrupole: -108.5492 -122.7177 -122.0244
quadrupole: 0.9183 4.4943 5.6715
quadrupole: 9.2146 -4.9539 -4.2606 0.9183 4.4943 5.6715
hfenergy: -992.9112872 hartree
pointgroup: C01 [X(C16H14O5)]
dipole: 2.4826217 0.4091118 0.3760947 debye
polarizability: 241.9885122|-53.6316972|236.5728198|10.200672|42.5508695|118.0167567 unknown
InChI: InChI=1S/C16H14O5/c1-16(2)11(21-16)8-19-15-13-10(5-6-18-13)7-9-3-4-12(17)20-14(9)15/h3-7,11H,8H2,1-2H3
charge 0 multiplicity 1
35 atoms
O  -4.0420 -1.424778 -0.06137
O  -0.541345 -1.730905 -1.115984
O  1.842025 -3.234533 -1.00722
O  -0.396987 1.011412 0.010754
O  -1.457619 2.980943 0.539972
C  -3.751119 0.064986 0.179077
C  -2.624317 -0.905388 -0.015027
C  -1.828616 -1.006759 -1.311855
C  -4.170524 0.992579 -0.949422
C  -4.076703 0.545803 1.582619
C  0.575258 -1.133901 -0.555198
C  1.748899 -1.921933 -0.520335
C  0.730571 0.169705 -0.0012
C  3.006389 -1.500088 0.009055
C  1.981967 0.629606 0.544082
C  3.127771 -0.205257 0.549339
C  3.911166 -2.627864 -0.169312
C  2.012543 1.972931 1.086302
C  3.185508 -3.630565 -0.771801
C  0.904385 2.789779 1.101552
C  -0.380375 2.350358 0.571084
H  -2.066615 -1.227028 0.876928
H  -1.628679 -0.020463 -1.760359
H  -2.362002 -1.649814 -2.029831
H  -4.0162 0.531371 -1.93961
H  -3.586032 1.929219 -0.892355
H  -5.242266 1.245504 -0.858116
H  -3.767425 -0.196376 2.338403
H  -5.16339 0.715734 1.692694
H  -3.554147 1.499766 1.780954
H  4.070752 0.161482 0.965669
H  4.959774 -2.677088 0.116006
H  2.960649 2.337337 1.499256
H  3.423263 -4.639808 -1.096394
H  0.929841 3.800934 1.514345
