program: Gaussian 09
title: 000182249
version: EM64L-G09RevD.01
frameworkgroup: C1[X(C15H14O5)]
method: RPBEPBE
basis: SDD
operation: Freq
keyword: #pfreq=noraman
keyword: PBEPBE/SDD
title: #p freq=noraman PBEPBE/SDD
converged: NO YES NO NO
title: Mulliken charges:
elementType: O O O O O C C C C C C C C C C C C C C C H H H H H H H H H H H H H H
charge: -0.422159 -0.450674 -0.184055 -0.237844 -0.298082 -0.175726 0.296790 0.092244 0.207182 -0.034577 0.208202 -0.147458 -0.721642 -0.725040 -0.118029 0.029195 0.417143 -0.518970 -0.789314 -0.192655 0.264155 0.234457 0.215629 0.245740 0.216600 0.211159 0.260002 0.273657 0.225889 0.247023 0.263367 0.297919 0.402050 0.407823
chargesum: 0.00000
title: Mulliken charges with hydrogens summed into heavy atoms:
elementType: O O O O O C C C C C C C C C C C C C C C
charge: -0.020109 -0.042850 -0.184055 -0.237844 -0.298082 0.088429 0.296790 0.092244 0.207182 -0.034577 0.208202 -0.147458 -0.025816 -0.037279 -0.118029 0.029195 0.417143 -0.245313 -0.053035 0.105263
polarizability: 2.45751852e+02 1.02038669e+01 2.51682061e+02 7.53450075e-01 -4.77307583e+00 9.46121261e+01
1716.lowfreq: -7.8944 -3.2060 -1.6380 -0.0002 -0.0002 0.0005 25.1075 46.2033 55.3400
frequency: 25.0875 46.1538 55.3376 71.8045 108.7569 118.0085 144.6912 175.2626 188.5888 204.4291 207.6927 229.5240 237.4171 255.4047 276.3456 288.4603 301.5514 321.7542 334.3497 338.8528 385.2741 392.9847 410.8059 419.7457 433.9400 453.5979 494.0568 516.6028 582.5402 586.9689 599.6672 614.4632 638.4974 669.2696 704.4189 733.5371 754.9775 818.9542 822.3055 829.5734 900.2969 905.0281 927.0813 953.1476 962.4134 971.7959 999.6033 1047.7053 1049.8845 1062.7764 1080.7698 1107.0112 1132.8740 1162.1688 1199.3944 1212.3180 1254.1267 1274.9049 1282.5895 1296.4584 1307.5172 1315.6473 1348.1142 1356.4768 1371.3028 1374.8360 1387.8347 1398.1845 1414.8426 1442.3679 1443.8501 1458.9616 1465.5874 1476.6926 1480.8764 1496.4352 1516.1917 1533.9215 1550.2723 1565.9888 1598.3852 1661.6397 2405.4232 2985.0985 2988.1824 2989.8524 3068.5502 3071.2372 3074.9534 3084.4873 3103.1710 3108.5641 3116.7841 3117.8988 3148.2263 3415.6790
redmass: 7.7210 3.8800 4.3262 4.1217 1.7366 1.9428 6.3802 2.9574 2.6886 2.0658 2.6635 1.9992 1.2714 2.9386 3.6334 5.3190 4.4626 5.5265 6.5869 7.8158 5.3147 6.0227 3.6768 5.1718 5.9573 4.8012 9.6035 5.2653 4.4568 4.5498 1.2301 5.8512 6.8880 4.2703 4.5473 7.0080 7.8359 7.2499 6.9748 3.5932 2.6998 1.5744 1.1969 4.7542 1.4074 1.7133 1.7792 1.5772 2.7231 1.0560 3.6902 2.8732 2.1368 2.4047 3.5180 2.3750 1.8912 2.7250 2.6480 1.3782 2.1583 1.6770 3.0399 2.4497 1.1866 4.8485 1.2686 1.2519 3.4598 2.5042 1.2922 1.0885 1.0463 1.0526 1.0555 1.0672 7.5110 6.3609 7.8696 3.4055 4.9508 7.2281 1.0758 1.0366 1.0349 1.0374 1.0948 1.0994 1.0878 1.0973 1.1004 1.1011 1.0947 1.0965 1.0933 1.0639
irintensity: 3.3541 0.2072 3.0454 2.4973 0.5000 1.9682 1.0475 0.2863 0.4867 2.0465 0.6302 2.3328 0.5346 0.6549 2.3896 14.1180 2.1560 1.2218 2.7164 0.8048 6.8542 3.0056 3.8445 16.8015 4.6601 0.6405 10.7805 2.5815 11.6041 21.3506 107.5917 19.3550 6.5864 9.0355 2.5389 28.9445 4.3203 6.6746 3.6766 38.7530 1.2804 18.1331 5.1300 12.3566 0.2003 1.7170 37.3256 7.7472 57.7430 155.6032 59.3538 1.4080 87.7538 10.3269 47.9939 24.0447 314.3462 155.6676 3.7415 40.5913 168.3155 12.8642 41.0105 382.8647 22.2788 20.5837 47.2966 40.7585 123.9602 47.7223 17.9923 5.8928 2.5922 4.4337 6.7224 9.8806 34.5764 210.2666 36.8670 29.4624 227.6485 43.9925 367.9670 40.6312 37.4382 7.2750 6.8964 30.1860 3.7297 36.0153 4.9719 15.6260 8.7903 18.7909 8.2516 123.0473
temp: 298.150 k
press: 1.00000 atm
elementType: 8 8 8 8 8 6 6 6 6 6 6 6 6 6 6 6 6 6 6 6 1 1 1 1 1 1 1 1 1 1 1 1 1 1
symmnumber: 1
zpe: 671212.9 jmol-1
zpe.correction: 0.255651 hartree
zpe.thermalcorrener: 0.274499 hartree
zpe.thermalcorrenthalpy: 0.275444 hartree
zpe.thermalcorrgfe: 0.208727 hartree
zpe.sumelectzpe: -954.673491 hartree
zpe.sumelectthermal: -954.654643 hartree
zpe.sumelectthermalent: -954.653699 hartree
zpe.sumelectthermalfe: -954.720415 hartree
dipole: 1.7591 1.2472 0.7904
dipole: 2.2966
quadrupole: -109.3444 -130.7589 -117.0087
quadrupole: -8.4623 2.5836 2.7241
quadrupole: 9.6930 -11.7216 2.0286 -8.4623 2.5836 2.7241
hfenergy: -954.9291423 hartree
pointgroup: C01 [X(C15H14O5)]
dipole: 0.1257368 0.8390323 0.3108762 debye
polarizability: 238.8066669|-3.60764|258.75063|0.5941323|-2.1039509|94.4887413 unknown
InChI: InChI=1S/C15H14O5/c1-6(2)10-12-11(8(5-16)14(19)15(10)20)9(17)4-7(3)13(12)18/h4-6,19-20H,1-3H3
charge 0 multiplicity 1
34 atoms
O  -3.381669 -0.591813 -0.019931
O  -2.148335 -2.89615 -0.175384
O  0.462167 2.928671 -0.760767
O  3.028924 -1.755338 0.062199
O  -0.116333 -4.279478 -0.227692
C  -2.0659 1.982064 0.181053
C  -1.28514 0.677046 -0.014405
C  0.159123 0.59727 -0.111464
C  0.850803 -0.657584 -0.102952
C  -1.993344 -0.544931 -0.050888
C  0.100615 -1.888689 -0.126076
C  0.971112 1.848007 -0.319129
C  -2.910423 2.322338 -1.079147
C  -2.938054 1.945577 1.468309
C  -1.323073 -1.7982 -0.129977
C  2.348156 -0.67518 -0.007111
C  2.453195 1.818927 -0.075869
C  3.073616 0.608739 0.054601
C  3.176604 3.139414 -0.068564
C  0.659843 -3.245535 -0.188129
H  -1.340527 2.799276 0.297546
H  -2.26052 2.432242 -1.964765
H  -3.435172 3.282075 -0.92047
H  -3.664814 1.542805 -1.277967
H  -3.390935 2.942999 1.618116
H  -2.326698 1.715038 2.360502
H  -3.748271 1.203695 1.396558
H  4.158279 0.522891 0.183269
H  4.26583 3.001234 0.023684
H  2.824569 3.773523 0.766557
H  2.953815 3.705232 -0.990575
H  1.749405 -3.380696 -0.20853
H  -3.652297 -1.553902 -0.064371
H  -1.50515 -3.744768 -0.209234
