program: Gaussian 09
title: 000182245
version: EM64L-G09RevD.01
frameworkgroup: C1[X(C6H5Cl2FN2O)]
method: RPBEPBE
basis: SDD
operation: Freq
keyword: #p
keyword: freq=noraman
keyword: PBEPBE/SDD
title: #p freq=noraman PBEPBE/SDD
converged: NO NO NO NO
title: Mulliken charges:
elementType: Cl Cl F O N N C C C C C C H H H H H
charge: -0.021341 -0.019523 -0.166185 -0.245845 -0.032972 -0.655129 0.726698 -0.413406 0.245742 -0.438117 0.139029 -0.503240 0.330464 0.330625 0.242777 0.237649 0.242774
chargesum: 0.00000
title: Mulliken charges with hydrogens summed into heavy atoms:
elementType: Cl Cl F O N N C C C C C C
charge: -0.021341 -0.019523 -0.166185 -0.245845 -0.032972 0.005960 0.726698 -0.413406 0.245742 -0.438117 0.139029 0.219961
polarizability: 1.48124221e+02 6.27072996e+00 1.22766832e+02 -2.11066011e-03 -5.65038686e-03 4.41848630e+01
1716.lowfreq: 0.0021 0.0037 0.0044 6.5745 7.4170 8.2654 71.4899 101.7448 112.2120
frequency: 71.4862 101.7409 112.2110 142.2928 166.7041 187.1175 214.6213 239.0892 294.8478 302.8112 329.8638 344.1745 373.5209 429.6801 512.1491 518.0976 556.5597 569.8792 621.7343 642.2643 645.9403 704.6136 724.3807 906.0628 998.4059 1032.3148 1085.0938 1113.9075 1117.7980 1152.9450 1324.6076 1362.8914 1412.1975 1452.0322 1455.7219 1465.3605 1485.3703 1537.1248 1589.1153 1631.0493 3003.4643 3105.7339 3147.8491 3533.9342 3679.8451
redmass: 7.0281 9.4352 2.6310 1.3164 4.6311 16.5120 5.4964 9.4655 9.9846 7.0006 6.6124 7.6494 8.5910 6.3717 1.1073 1.1580 13.3914 7.9158 12.1496 11.5058 4.7232 8.5243 12.1658 9.1060 9.8733 5.7457 2.8057 1.2509 2.9157 1.5181 6.3539 6.3999 2.5693 1.0497 2.0604 1.0855 5.4857 7.2342 2.7494 1.8323 1.0294 1.1046 1.1048 1.0448 1.1048
irintensity: 3.5299 0.0115 7.2784 2.0214 4.8806 1.7311 0.0347 3.7615 3.7010 4.0383 4.2633 0.0243 1.3414 0.1881 97.6645 191.6340 0.2093 1.2189 0.2272 0.2537 14.0128 74.2614 21.1922 6.3318 82.0880 99.2230 41.5907 0.0933 74.6335 36.1510 144.0051 263.4003 60.2912 14.5454 123.3860 13.8802 0.1710 62.1788 81.0926 482.6539 43.8303 26.4958 18.9438 91.4045 56.8141
temp: 298.150 k
press: 1.00000 atm
elementType: 17 17 9 8 7 7 6 6 6 6 6 6 1 1 1 1 1
symmnumber: 1
zpe: 283506.6 jmol-1
zpe.correction: 0.107982 hartree
zpe.thermalcorrener: 0.119855 hartree
zpe.thermalcorrenthalpy: 0.120799 hartree
zpe.thermalcorrgfe: 0.069571 hartree
zpe.sumelectzpe: -1435.433281 hartree
zpe.sumelectthermal: -1435.421408 hartree
zpe.sumelectthermalent: -1435.420464 hartree
zpe.sumelectthermalfe: -1435.471692 hartree
dipole: -0.5350 2.4540 -0.0001
dipole: 2.5116
quadrupole: -80.3494 -75.7853 -83.2311
quadrupole: 14.3483 -0.0008 -0.0005
quadrupole: -0.5608 4.0033 -3.4425 14.3483 -0.0008 -0.0005
hfenergy: -1435.5412631 hartree
pointgroup: C01 [X(C6H5Cl2F1N2O1)]
dipole: 0.0135111 0.9880511 0.0000576 debye
dipolederiv: -0.2138149 -0.2191129 -0.0000085 -0.2962693 -0.6201147 -0.0000292 -0.0000128 -0.0000316 -0.0182519 -0.79412 -0.0740055 0.0000173 -0.0083479 -0.1019577 -0.0000051 0.000019 -0.0000038 -0.0088944 -0.3683597 -0.3211271 -0.0000153 -0.3623057 -0.9624891 -0.0000419 -0.0000161 -0.0000387 -0.1599408 -1.7168358 0.520238 0.0000745 0.2357011 -0.4278596 -0.0000154 0.0000437 -0.0000145 -0.3017198 -1.1743927 -0.0591748 0.0000256 -0.2447898 -0.6725435 -0.0000251 0.0000144 -0.0000289 -0.1961797 -0.6183698 0.5383446 0.0000404 0.6028928 -0.9991263 -0.0000473 0.0000591 -0.0000621 -0.6450944 0.5819863 -0.6473369 -0.0000617 -0.6271173 0.9124572 0.000075 -0.0000627 0.0000753 0.1780027 -0.4093224 0.7519397 0.0000571 0.7012086 0.5519321 0.0000216 0.0000502 0.0000233 -0.1481394 1.8672092 -0.5124701 -0.0000808 0.0515354 0.4319915 0.0000171 -0.0000457 0.0000293 0.1975834 0.8863535 0.1576935 -0.0000178 0.1715484 -0.5148858 -0.0000298 -0.0000121 -0.0000275 -0.1520729 0.8861922 0.2322329 -0.0000062 0.1750303 1.3561155 0.000069 -0.0000109 0.0000628 0.2193713 0.6399862 -0.2301877 -0.0000258 -0.4471732 0.4926889 0.000033 -0.0000318 0.0000246 0.2766532 0.2435647 -0.0589723 -0.0000023 -0.0415213 0.2473192 -0.0000087 -0.000008 -0.0000018 0.3741687 0.2071938 -0.0333704 0.000004 -0.0574245 0.2730698 -0.0000037 -0.0000008 0.0000025 0.3736724 0.0622839 -0.0213769 0.0651714 0.1107376 -0.0189097 0.0745662 0.0198696 0.0911578 -0.0573943 -0.1418356 -0.0019567 -0.0000068 -0.0744576 0.0712004 -0.0000089 -0.000012 -0.0000077 0.1256727 0.0622811 -0.0213575 -0.0651652 0.1107524 -0.0188881 -0.0745667 -0.0198431 -0.091159 -0.0574368 unknown
polarizability: 149.5669521|-0.810355|121.3241002|-0.0031962|0.0051153|44.184863 unknown
InChI: InChI=1S/C6H5Cl2FN2O/c1-12-6-3(8)4(10)2(7)5(9)11-6/h10H2,1H3
charge 0 multiplicity 1
17 atoms
Cl 1.289069 2.735204 0.000246
Cl -3.374879 -0.361301 0.000183
F  -1.304801 -2.614815 -0.00002
O  2.582296 0.001822 0.000034
N  0.602888 -1.295582 0.000006
N  -1.724204 2.224706 0.000315
C  -0.962995 1.081271 0.000203
C  0.461613 1.121157 0.000167
C  1.206646 -0.078522 0.000065
C  -1.565591 -0.219484 0.000142
C  -0.732955 -1.340731 0.000041
C  3.32393 -1.279399 -0.000047
H  -2.739842 2.158478 0.000323
H  -1.268588 3.135103 0.000349
H  3.076896 -1.870111 0.898075
H  4.380956 -0.978045 0.000014
H  3.076962 -1.86995 -0.898296
