program: Gaussian 09
title: 000191735
version: EM64L-G09RevD.01
frameworkgroup: C1[X(C22H23ClFN3O2)]
method: RPBEPBE
basis: SDD
operation: Freq
keyword: #p
keyword: freq=noraman
keyword: PBEPBE/SDD
title: #p freq=noraman PBEPBE/SDD
converged: NO YES NO NO
title: Mulliken charges:
elementType: Cl F O O N N N C C C C C C C C C C C C C C C C C C C C C C H H H H H H H H H H H H H H H H H H H H H H H
charge: -0.065168 -0.198198 -0.254596 -0.227931 -0.076280 -0.253211 -0.455987 -0.035585 -0.437822 -0.443833 -0.378395 -0.378517 -0.348194 0.273603 -0.448447 0.140873 0.272282 -0.505300 -0.326114 -0.328187 -0.223918 -0.076357 0.120128 0.292722 -0.308322 -0.320068 -0.385955 -0.372643 0.332195 0.194191 0.201765 0.262530 0.259381 0.204824 0.168968 0.219025 0.229115 0.173249 0.194928 0.198052 0.233226 0.223843 0.333920 0.274844 0.227194 0.239269 0.264045 0.253583 0.257540 0.283426 0.259687 0.260618
chargesum: 0.00000
title: Mulliken charges with hydrogens summed into heavy atoms:
elementType: Cl F O O N N N C C C C C C C C C C C C C C C C C C C C C C
charge: -0.065168 -0.198198 -0.254596 -0.227931 -0.076280 -0.253211 -0.122067 0.158606 0.026472 0.020372 0.009599 0.023846 0.044787 0.273603 0.008623 0.140873 0.272282 -0.003262 -0.086845 -0.064142 0.029665 -0.076357 0.120128 0.292722 -0.050782 -0.036642 -0.126267 -0.112025 0.332195
polarizability: 3.81305505e+02 -2.64450052e+01 2.70343641e+02 5.44153478e+00 -2.05537927e+01 1.85304918e+02
1716.lowfreq: -15.6522 -7.5429 -4.6976 -0.0016 -0.0013 -0.0009 6.9575 9.9510 12.0609
frequency: -4.2719 7.3816 11.8525 21.1900 33.9123 43.4199 61.4322 89.2974 90.7108 102.3135 119.8759 146.1207 150.0841 176.4539 199.4473 211.3545 235.0306 240.7600 249.3647 256.3113 281.0179 285.6820 316.4003 333.9847 347.6133 358.4740 369.2645 374.2604 402.2007 410.7904 427.1374 450.9990 463.8253 475.7083 482.9449 493.2011 536.8154 539.0629 559.3449 566.6550 581.3542 582.4982 585.5722 624.9280 681.7241 694.8630 709.9840 715.4464 727.3329 731.6008 755.3177 780.7416 794.9072 795.4468 812.1378 814.3859 821.3211 845.5835 851.4910 854.8220 881.9528 897.3482 919.7887 931.9915 940.0555 946.2202 959.6856 981.8630 988.2891 994.7089 1003.7669 1011.0736 1042.1645 1057.2830 1066.4266 1095.5404 1104.2065 1106.8662 1111.1819 1117.4128 1128.3704 1129.8602 1144.5230 1152.1970 1155.7821 1173.7464 1192.8923 1201.0505 1207.8125 1232.0959 1235.5867 1258.7208 1271.3976 1273.5858 1284.7484 1293.0512 1294.0835 1302.7790 1311.7937 1314.8620 1331.2750 1334.0186 1337.0788 1344.0696 1358.8780 1368.6886 1380.7298 1381.0463 1391.4335 1406.8817 1409.8661 1437.9764 1451.9390 1455.6162 1461.5808 1466.5385 1469.3645 1475.1085 1479.5659 1489.1726 1491.1866 1569.7796 1600.9297 1606.3694 1612.1643 1628.4984 1674.6596 2808.5955 2818.3846 2853.3847 2957.4228 2991.7828 3000.7574 3003.8248 3004.5195 3006.3790 3012.2089 3030.7202 3048.3908 3066.1346 3075.2478 3081.4525 3154.7305 3154.9825 3156.7263 3173.9681 3177.3826 3179.8614 3180.4967 3620.0078
redmass: 6.5252 8.3388 6.5607 4.5338 6.0522 5.8403 3.7460 5.2841 6.0215 8.9777 4.5335 3.6264 5.1549 5.1996 2.9153 5.9866 3.9254 2.4428 4.3179 4.3747 3.2017 6.2532 4.7740 3.8995 2.6892 5.2223 4.7975 6.5628 4.8016 2.9438 3.3174 2.5481 4.6977 3.2115 3.2631 3.4425 3.2637 6.4281 1.1364 2.1548 4.6132 5.8588 3.3423 7.1852 7.7509 7.0083 11.0528 2.3936 3.2464 4.0327 5.2748 2.7710 1.6975 1.6053 4.7787 1.4919 1.3159 1.7050 1.4526 2.5722 2.0486 4.7245 1.3413 1.8115 3.0511 2.2699 1.5072 1.5388 1.3803 3.1368 2.4521 2.3100 2.2405 2.0260 2.0272 2.2387 1.3546 2.4908 2.5102 2.4507 2.2801 2.2269 2.0977 1.5088 1.4255 2.1505 1.6813 2.1212 1.9017 1.4215 1.5117 1.4816 1.3007 1.3786 1.4141 1.4132 1.5377 1.3682 1.5560 1.8034 1.5011 1.6109 1.4450 3.4336 1.6417 1.4562 5.7824 1.5246 1.4670 3.6508 4.0565 1.1031 3.2100 1.0860 1.0839 1.0837 1.0951 1.0838 1.0977 5.4672 2.5884 8.0154 7.2420 7.8831 7.1185 8.1090 8.7783 1.0720 1.0705 1.0701 1.0606 1.0833 1.0867 1.0924 1.0614 1.0628 1.0675 1.0862 1.0880 1.0994 1.1024 1.1018 1.0895 1.0889 1.0890 1.0937 1.0964 1.0962 1.0974 1.0810
irintensity: 0.3780 0.1397 0.9401 0.1395 0.0663 0.2469 0.1436 4.3971 0.0698 1.3019 0.4170 2.2636 1.6134 2.5079 0.3329 3.9023 9.0543 2.1561 7.4286 1.0922 1.0581 0.4510 3.8306 1.4149 2.7082 3.7401 2.4582 4.2772 7.3752 0.0565 3.0613 0.2045 3.9012 2.7029 5.5536 3.4153 40.5251 4.1818 113.3099 8.3685 8.3476 27.1615 19.6364 0.3385 34.3090 1.6333 9.3406 7.0671 6.6634 0.3826 1.6049 24.7959 19.2677 52.2899 19.1804 0.5709 4.9069 62.2440 33.3223 3.6326 20.8722 42.8797 0.0643 6.7182 12.6775 7.2196 8.9770 4.7767 0.6684 19.5530 37.2391 33.4093 2.8484 21.2517 11.5143 1.1607 9.3725 0.9870 16.2866 25.8010 4.3312 13.0399 38.9657 17.9099 86.2738 44.8867 8.3607 8.3530 43.1422 14.0672 94.1155 13.2021 29.0756 83.9361 42.1539 1.3116 6.8735 22.3801 63.6498 44.9149 73.2592 59.5564 0.2040 83.1140 51.3855 1.0380 19.2444 16.6007 1.5526 21.0017 17.2976 18.4106 47.5713 8.8522 4.0158 2.8302 6.7749 23.0654 14.9699 184.5557 24.6407 113.0592 71.8549 49.0370 64.0902 9.1079 640.3107 42.0525 135.5621 187.8483 58.6828 12.9878 23.4533 6.7053 27.3008 19.2686 23.3580 48.5838 28.3265 46.1755 6.2582 28.2240 8.6750 5.9757 0.0614 1.2231 4.4662 1.8449 4.0972 75.0381
temp: 298.150 k
press: 1.00000 atm
elementType: 17 9 8 8 7 7 7 6 6 6 6 6 6 6 6 6 6 6 6 6 6 6 6 6 6 6 6 6 6 1 1 1 1 1 1 1 1 1 1 1 1 1 1 1 1 1 1 1 1 1 1 1
symmnumber: 1
zpe: 1078862.3 jmol-1
zpe.correction: 0.410917 hartree
zpe.thermalcorrener: 0.436132 hartree
zpe.thermalcorrenthalpy: 0.437077 hartree
zpe.thermalcorrgfe: 0.351772 hartree
zpe.sumelectzpe: -1724.671241 hartree
zpe.sumelectthermal: -1724.646026 hartree
zpe.sumelectthermalent: -1724.645082 hartree
zpe.sumelectthermalfe: -1724.730386 hartree
dipole: -1.8479 1.9521 1.9395
dipole: 3.3147
quadrupole: -207.6732 -170.2896 -177.8104
quadrupole: 2.0932 3.6623 5.3794
quadrupole: -22.4155 14.9682 7.4473 2.0932 3.6623 5.3794
hfenergy: -1725.0821584 hartree
pointgroup: C01 [X(C22H23Cl1F1N3O2)]
dipole: -0.7310881 0.8461114 0.671008 debye
polarizability: 380.3835321|-26.4585431|266.1265574|11.327991|-28.9798186|190.4439748 unknown
InChI: InChI=1S/C22H23ClFN3O2/c23-16-5-8-20-19(14-16)25-22(29)27(20)18-9-12-26(13-10-18)11-1-2-21(28)15-3-6-17(24)7-4-15/h3-8,14,18,25H,1-2,9-13H2
charge 0 multiplicity 1
52 atoms
Cl -8.959505 -0.952646 -0.858291
F  7.395115 -3.648156 0.778839
O  -1.604451 -1.837135 0.919348
O  4.833964 1.602021 -1.861376
N  0.488654 2.256711 0.386668
N  -3.128461 -0.096974 0.234212
N  -3.940095 -2.178368 0.498973
C  -2.182319 1.041304 0.17102
C  -1.521076 1.324686 1.540878
C  -1.094606 0.823892 -0.90712
C  -0.547512 2.513881 1.416658
C  -0.130801 2.027723 -0.942062
C  1.535061 3.312503 0.370162
C  -4.504256 -0.056647 -0.074023
C  2.800233 2.903781 -0.413613
C  -2.746387 -1.417158 0.591272
C  -5.019851 -1.381414 0.096295
C  3.408251 1.593748 0.116035
C  -5.346657 0.992399 -0.482437
C  -6.37164 -1.685877 -0.133649
C  -6.714287 0.702087 -0.719305
C  -7.193061 -0.612816 -0.54289
C  4.524735 1.041348 -0.766419
C  5.256951 -0.196053 -0.321167
C  4.904879 -0.916741 0.852757
C  6.339217 -0.660294 -1.119159
C  5.615243 -2.076046 1.227402
C  7.062774 -1.812361 -0.760907
C  6.680099 -2.494026 0.409877
H  -2.78536 1.926935 -0.113461
H  -2.295695 1.552537 2.297411
H  -0.969209 0.425794 1.865885
H  -0.530734 -0.094111 -0.665654
H  -1.563689 0.693904 -1.900611
H  -1.128988 3.446819 1.181301
H  -0.044018 2.680393 2.386738
H  0.663798 1.83365 -1.682874
H  -0.684568 2.943508 -1.286175
H  1.140578 4.273808 -0.049137
H  1.811801 3.513184 1.424348
H  2.586432 2.797197 -1.492244
H  3.540101 3.723355 -0.342608
H  -3.951963 -3.174597 0.704977
H  2.597441 0.840764 0.210993
H  3.796228 1.735667 1.146029
H  -4.976305 2.01226 -0.620799
H  -6.77584 -2.693344 -0.00727
H  -7.397043 1.49382 -1.038428
H  4.069574 -0.585406 1.47705
H  6.591287 -0.094386 -2.021673
H  5.356611 -2.647662 2.123084
H  7.898651 -2.182264 -1.361352
