program: Gaussian 09
title: 000182234
version: EM64L-G09RevD.01
frameworkgroup: C1[X(C15H8O3)]
method: RPBEPBE
basis: SDD
operation: Freq
keyword: #pfreq=noraman
keyword: PBEPBE/SDD
title: #p freq=noraman PBEPBE/SDD
converged: NO NO NO NO
title: Mulliken charges:
elementType: O O O C C C C C C C C C C C C C C C H H H H H H H H
charge: -0.253458 -0.242779 -0.189267 0.212981 0.200468 0.217553 0.169686 -0.567714 0.417515 0.184899 -0.510901 -0.384034 -0.352750 -0.272876 -0.237283 -0.215234 -0.307652 0.114903 0.252619 0.293418 0.241731 0.260510 0.248238 0.230383 0.234933 0.254114
chargesum: 0.00000
title: Mulliken charges with hydrogens summed into heavy atoms:
elementType: O O O C C C C C C C C C C C C C C C
charge: -0.253458 -0.242779 -0.189267 0.212981 0.200468 0.217553 0.169686 -0.315096 0.417515 0.184899 -0.217482 -0.142303 -0.092240 -0.024638 -0.006900 0.019698 -0.053539 0.114903
polarizability: 3.59088749e+02 -8.46204197e-01 1.60071154e+02 -1.77901492e-03 -2.36895727e-03 6.37040924e+01
1716.lowfreq: -8.1362 -2.1350 -0.0001 0.0005 0.0008 10.2611 52.2909 94.8930 123.6568
frequency: 52.2846 94.8926 123.6512 141.7325 188.9869 235.6270 253.0502 315.6715 327.8443 356.9780 420.7748 441.7222 442.2913 448.6625 480.9078 515.2713 542.3486 561.5667 600.4695 619.4842 641.7405 681.0302 699.7558 722.0354 741.6043 752.5222 769.0504 773.3651 792.6267 810.5875 828.2022 847.9655 863.3248 868.5087 900.1292 944.1254 970.2692 982.7659 987.3971 1012.7492 1033.4203 1087.6098 1107.0703 1152.1640 1164.4561 1172.2702 1201.1949 1221.7908 1245.0287 1260.2923 1306.0959 1370.6487 1396.6820 1409.3943 1429.9591 1450.1085 1465.7710 1480.4004 1565.4672 1595.2816 1612.1093 1619.5099 1649.1417 1695.2480 3132.7513 3136.6085 3144.0680 3148.9051 3165.1407 3179.9606 3187.3035 3194.7145
redmass: 8.1423 4.5282 8.7456 6.0413 4.5605 6.8421 8.6131 6.2813 7.1840 4.9973 3.9410 2.8055 7.6441 3.5301 7.8238 8.1764 5.1254 4.0118 8.6051 7.5016 4.0585 7.2675 5.7527 6.9086 4.3067 1.9414 1.8625 7.1322 7.0044 7.4099 1.5216 4.4522 1.4053 1.4941 1.5563 1.3904 5.0134 1.3146 1.3225 2.0095 3.5472 2.7844 2.4224 1.9880 1.3098 2.0774 2.0287 1.4054 1.7279 2.1124 2.1054 2.2757 4.3948 5.7267 2.8289 3.5195 3.8981 4.4585 9.4825 7.2645 7.4670 7.6685 8.4429 10.9555 1.0906 1.0862 1.0925 1.0912 1.0962 1.0986 1.0954 1.0941
irintensity: 0.4570 3.6433 0.7661 0.0099 0.5782 2.2381 0.8384 2.1508 4.2000 0.5714 0.3038 0.9257 5.1442 11.4558 6.5567 4.9797 9.2214 0.2524 2.8298 0.0456 0.3422 53.7247 7.8479 0.8870 1.3034 41.5881 58.9997 1.4109 10.9970 4.5575 34.2887 67.1263 5.6985 27.4930 46.4971 2.8469 40.1830 0.0309 0.6603 17.8907 129.8368 5.5990 135.4286 52.1873 0.8771 7.7008 55.5925 34.9355 7.8721 21.0646 25.2406 13.2067 30.2171 3.2252 51.6582 12.3867 32.6341 10.6068 98.3226 10.6952 7.9922 144.5531 138.4336 619.2488 9.2260 1.0023 3.8451 10.3071 21.7488 12.5234 2.1462 1.3409
temp: 298.150 k
press: 1.00000 atm
elementType: 8 8 8 6 6 6 6 6 6 6 6 6 6 6 6 6 6 6 1 1 1 1 1 1 1 1
symmnumber: 1
zpe: 488881.1 jmol-1
zpe.correction: 0.186205 hartree
zpe.thermalcorrener: 0.198688 hartree
zpe.thermalcorrenthalpy: 0.199632 hartree
zpe.thermalcorrgfe: 0.147290 hartree
zpe.sumelectzpe: -800.877739 hartree
zpe.sumelectthermal: -800.865256 hartree
zpe.sumelectthermalent: -800.864312 hartree
zpe.sumelectthermalfe: -800.916654 hartree
dipole: 5.2744 4.2484 -0.0006
dipole: 6.7726
quadrupole: -114.2761 -91.9490 -106.6249
quadrupole: -12.6378 0.0035 0.0009
quadrupole: -9.9928 12.3344 -2.3416 -12.6378 0.0035 0.0009
hfenergy: -801.0639435 hartree
pointgroup: C01 [X(C15H8O3)]
dipole: -2.0708358 -1.6767593 -0.000246 debye
dipolederiv: -1.6092914 -0.0129122 0.0000048 0.0565946 -0.4496292 -0.0000063 -0.0000044 -0.0000133 -0.1533135 -1.6622032 -0.06034 -0.0000984 0.3084247 -0.3325935 0.0000702 0.00011 -0.0000195 -0.1992087 -1.6590446 -0.2185345 0.0001137 -0.6818025 -0.5242272 0.0000603 -0.0006193 -0.0001088 -0.3307681 -0.0121099 -0.0821472 -0.0000022 0.6509746 -0.263199 -0.0000143 0.0000198 -0.0000014 0.0075862 0.2620948 0.1474689 0.0000023 -0.2297443 -0.1331081 -0.0000006 -0.0000144 -0.0000039 -0.0014686 0.9050087 -0.1110138 0.0000021 -0.9067421 0.3402649 0.0000163 -0.0000207 0.0000148 0.0774995 0.6959267 0.2151939 0.0000016 0.8088175 0.2676111 0.000001 0.0000183 0.000001 0.0699157 0.59322 -0.059588 -0.0000113 -0.0655858 0.1311143 0.0000083 -0.0000148 -0.0000101 -0.1416591 -0.7489789 0.0354246 0.0000187 0.2049705 -0.2814715 -0.0000112 -0.0000516 0.0000099 0.0157968 0.9150105 0.1063761 0.000004 0.0804863 0.2603301 0.0000006 -0.0000209 -0.0000202 0.1041419 -0.4803035 0.0331709 -0.0000066 0.1302388 0.0176537 0.0000032 0.0000605 0.0000216 -0.1762746 0.0457403 -0.0572168 -0.0000042 0.0601567 0.1011009 0.0000053 -0.0000007 0.0000069 -0.1428 -0.1168936 -0.1159988 -0.0000034 -0.1391272 0.0379338 0.0000058 -0.0000031 0.0000064 -0.1609979 1.0194037 -0.0598757 -0.0000449 -0.3318785 0.2666981 -0.0000248 0.0000744 0.0000066 -0.0729855 -0.115488 0.1100639 0.0000012 0.1887608 -0.0009635 0.0000028 0.0000057 0.000003 -0.1653224 -0.0256622 -0.0014262 -0.0000023 -0.0958546 0.055989 0.0000058 -0.0000025 0.0000057 -0.1623863 -0.7080405 -0.094648 0.0000514 -0.7190997 -0.2407273 -0.0000386 0.0000277 0.0000347 -0.1888312 2.4267013 0.2120533 -0.0000173 0.6609895 0.8239106 -0.0000985 0.0004004 0.0000308 0.2809711 0.0772343 -0.0168225 -0.0000007 -0.0271904 -0.0555925 -0.000003 -0.0000016 0.0000033 0.1543024 0.0967261 -0.0117149 -0.0000001 -0.0102749 0.0419635 -0.0000029 0.0000018 0.0000004 0.1968573 0.0742683 0.0785897 0.0000032 0.0268352 -0.0615884 -0.0000059 0.0000014 -0.0000063 0.156561 0.0885776 0.0223537 0.0000016 0.0597138 -0.0306315 -0.0000057 0.0000023 -0.0000058 0.1828309 0.0939629 -0.0674262 -0.0000038 0.0226561 -0.0716742 0.0000211 0.00005 0.0000018 0.139754 -0.0361174 -0.0957664 -0.0000005 -0.1215771 -0.0206383 -0.0000034 -0.0000013 -0.0000038 0.1657045 -0.1231946 0.0395351 0.0000039 0.031608 0.085104 -0.0000025 0.0000033 -0.0000022 0.1632942 0.0034525 0.065201 -0.0000129 0.0376499 0.03637 0.0000172 -0.0000204 0.0000486 0.1808003 unknown
polarizability: 359.0917754|-0.3372431|160.0681271|0.001773|0.0023735|63.7040924 unknown
InChI: InChI=1S/C15H8O3/c16-15-6-5-9-7-11-10-3-1-2-4-12(10)17-14(11)8-13(9)18-15/h1-8H
charge 0 multiplicity 1
26 atoms
O  -1.630279 1.770604 0.000067
O  3.185325 1.069301 -0.000037
O  5.474192 0.751261 0.000339
C  -0.761524 -0.410997 -0.000002
C  -2.220885 -0.505278 0.000014
C  -0.454697 0.991258 0.000039
C  -2.706119 0.834224 0.000052
C  0.297026 -1.332551 -0.000035
C  1.63652 -0.853331 -0.000045
C  1.884906 0.564065 0.000002
C  0.83999 1.512632 0.00005
C  -3.15527 -1.566226 0.0000
C  -4.062259 1.175567 0.000078
C  2.786635 -1.730724 -0.000008
C  -4.532992 -1.251851 0.000024
C  -4.98036 0.097757 0.000062
C  4.073786 -1.240308 -0.000001
C  4.36471 0.190871 -0.000262
H  0.113501 -2.412486 -0.000047
H  1.053799 2.582907 0.000078
H  -2.824868 -2.610304 -0.00003
H  -4.390506 2.21826 0.000108
H  2.619218 -2.814416 0.000092
H  -5.271292 -2.060504 0.000012
H  -6.054564 0.310558 0.000079
H  4.945505 -1.899385 0.000172
