program: Gaussian 09
title: 000191661
version: EM64L-G09RevD.01
frameworkgroup: C1[X(C13H17NO2)]
method: RPBEPBE
basis: SDD
operation: Freq
keyword: #p
keyword: freq=noraman
keyword: PBEPBE/SDD
title: #p freq=noraman PBEPBE/SDD
converged: YES YES NO NO
title: Mulliken charges:
elementType: O O N C C C C C C C C C C C C C H H H H H H H H H H H H H H H H H
charge: -0.242765 -0.310440 -0.135581 -0.094231 -0.190992 -0.391781 -0.298525 -0.733425 0.399951 0.257101 -0.348220 -0.406687 -0.804891 -0.242500 -0.261452 -0.239479 0.270294 0.230308 0.233483 0.229287 0.219453 0.212551 0.221749 0.233070 0.231824 0.254646 0.282444 0.237607 0.268709 0.234059 0.226105 0.230259 0.228069
chargesum: 0.00000
title: Mulliken charges with hydrogens summed into heavy atoms:
elementType: O O N C C C C C C C C C C C C C
charge: -0.242765 -0.310440 -0.135581 0.176063 0.039316 0.070990 0.133479 -0.046783 0.399951 0.257101 -0.093573 -0.124243 -0.064516 -0.016395 -0.031194 -0.011410
polarizability: 1.63989453e+02 -3.24231670e+00 1.56319620e+02 -7.42018017e+00 -4.80046246e+00 1.14414566e+02
1716.lowfreq: -7.5901 -0.0008 -0.0006 -0.0006 2.7686 15.6701 40.0798 61.8330 71.0931
frequency: 39.9233 61.7505 71.0649 105.4291 135.8127 153.8497 177.5766 206.1900 215.1429 222.8003 259.7142 292.1826 313.5704 360.9636 403.8178 412.7991 437.6874 486.2094 493.1151 514.0131 560.6318 585.7430 613.6257 623.3830 676.2457 706.3950 709.4390 741.4088 803.2470 840.4592 863.0622 877.6998 900.8150 940.5637 955.9304 967.5942 986.5336 988.8908 1000.2785 1002.1218 1030.8897 1032.0237 1035.2270 1051.5582 1079.7346 1089.0441 1107.7646 1113.7025 1172.6255 1177.2169 1199.7619 1211.3843 1221.4142 1255.2259 1287.4678 1296.4947 1310.7904 1330.5673 1348.5710 1357.7428 1362.5136 1379.2903 1380.1084 1383.9108 1412.4924 1437.3894 1451.1554 1454.6594 1460.1626 1469.0285 1479.0780 1486.1998 1488.1248 1578.7546 1590.6762 1612.8861 2976.0874 2985.3421 2988.4754 2988.9768 3018.6280 3052.5684 3074.5947 3082.9008 3084.4480 3092.6404 3096.1044 3120.9549 3127.4965 3130.0110 3137.8651 3146.9502 3161.9292
redmass: 4.0946 4.0033 5.1018 3.6052 3.4744 2.8920 1.1883 1.7095 1.6497 3.3733 2.6397 3.9130 3.1922 4.3440 2.8825 3.5277 4.0043 2.7194 3.4562 3.2386 4.7278 3.3121 5.8580 4.5827 3.7760 2.4120 2.2830 1.7115 2.8151 3.0876 1.2723 2.7247 2.5909 1.5204 2.0104 2.1805 1.4529 4.6614 1.6875 1.6117 2.1796 1.6723 2.5419 2.4407 1.7397 1.9215 2.3482 1.8737 1.0570 2.7846 1.2317 2.5113 1.2387 1.3991 1.3145 1.7359 1.3877 1.2981 1.3268 1.3438 1.3484 1.3044 2.6289 1.5255 2.7247 2.2031 1.0815 1.0883 1.1160 1.0491 1.0561 1.2587 1.6351 6.4159 5.8539 5.7747 1.0688 1.0585 1.0392 1.0400 1.0847 1.0850 1.0982 1.0993 1.0979 1.0941 1.1003 1.0847 1.0881 1.0978 1.0926 1.0963 1.1016
irintensity: 0.2371 0.3847 6.4922 4.2260 0.7055 0.3536 1.1944 0.3833 2.0165 6.9042 4.4110 3.9583 2.3940 3.0077 0.6212 6.8656 4.3478 5.7009 8.1665 15.7136 11.7991 12.3738 1.6275 6.6525 2.5939 28.3344 15.4955 61.8838 8.2773 10.4363 0.1366 4.9548 26.0312 1.5604 26.2236 4.5390 0.4796 1.9063 29.1252 15.3756 7.5314 3.7500 12.4882 23.6660 6.4425 0.4817 19.2595 11.2465 0.0346 20.7055 3.7652 19.7624 47.3859 22.3663 12.4117 30.4548 23.4756 4.8404 13.8243 8.4471 5.3590 30.4313 9.9607 15.0464 119.9839 16.1514 24.7262 7.3363 28.5731 8.3661 9.1296 10.7315 7.3200 209.8921 1.3257 1.9333 36.1920 19.5494 35.5476 25.1427 18.6712 8.4856 15.8113 38.3770 37.3980 13.4244 15.5313 0.1573 7.1324 8.4930 5.2931 24.4992 33.4702
temp: 298.150 k
press: 1.00000 atm
elementType: 8 8 7 6 6 6 6 6 6 6 6 6 6 6 6 6 1 1 1 1 1 1 1 1 1 1 1 1 1 1 1 1 1
symmnumber: 1
zpe: 724394.4 jmol-1
zpe.correction: 0.275907 hartree
zpe.thermalcorrener: 0.290825 hartree
zpe.thermalcorrenthalpy: 0.291769 hartree
zpe.thermalcorrgfe: 0.234071 hartree
zpe.sumelectzpe: -709.578689 hartree
zpe.sumelectthermal: -709.563772 hartree
zpe.sumelectthermalent: -709.562828 hartree
zpe.sumelectthermalfe: -709.620525 hartree
dipole: 0.6334 -1.3505 2.8336
dipole: 3.2023
quadrupole: -88.0114 -101.0834 -92.8346
quadrupole: -5.4089 5.0361 5.5279
quadrupole: 5.9651 -7.1069 1.1418 -5.4089 5.0361 5.5279
hfenergy: -709.8545967 hartree
pointgroup: C01 [X(C13H17N1O2)]
dipole: -0.2165105 0.5743304 1.1002378 debye
polarizability: 163.2870799|-3.6566905|157.0442247|8.3015085|3.2055778|114.3923343 unknown
InChI: InChI=1S/C13H17NO2/c1-10-13(12-6-4-3-5-7-12)16-9-8-14(10)11(2)15/h3-7,10,13H,8-9H2,1-2H3
charge 0 multiplicity 1
33 atoms
O  0.04598 2.240328 0.388975
O  -2.147828 -1.952613 -0.976341
N  -1.807337 0.079854 0.099775
C  -1.142177 0.647146 -1.109797
C  0.232106 1.246965 -0.715141
C  -1.9230 0.999365 1.250106
C  -0.541929 1.602328 1.578891
C  -2.037168 1.699308 -1.801913
C  1.336136 0.243701 -0.359879
C  -2.312359 -1.216842 0.052019
C  2.56509 0.76322 0.127907
C  1.2047 -1.158603 -0.523842
C  -3.059671 -1.737529 1.278607
C  3.640209 -0.094125 0.442479
C  2.284317 -2.018215 -0.210283
C  3.503426 -1.492771 0.272274
H  -1.00306 -0.202102 -1.800196
H  0.578636 1.889473 -1.546426
H  -2.308564 0.460286 2.129744
H  -2.632747 1.816849 1.01186
H  -0.634334 2.409803 2.324107
H  0.137846 0.81555 1.964489
H  -1.607199 1.973753 -2.782377
H  -3.046153 1.287508 -1.977361
H  -2.120738 2.621729 -1.200931
H  2.661543 1.845966 0.26969
H  0.271402 -1.596445 -0.894859
H  -2.388704 -1.842115 2.151376
H  -3.455043 -2.731622 1.023908
H  -3.901282 -1.082563 1.568157
H  4.58201 0.324642 0.815224
H  2.167426 -3.099685 -0.343757
H  4.337265 -2.162441 0.511912
