program: Gaussian 09
title: 000191722
version: EM64L-G09RevD.01
frameworkgroup: C1[X(C12H20N2O7)]
method: RPBEPBE
basis: SDD
operation: Freq
keyword: #p
keyword: freq=noraman
keyword: PBEPBE/SDD
title: #p freq=noraman PBEPBE/SDD
converged: YES YES NO NO
title: Mulliken charges:
elementType: O O O O O O O N N C C C C C C C C C C C C H H H H H H H H H H H H H H H H H H H H
charge: -0.291320 -0.419925 -0.225217 -0.398288 -0.401337 -0.226799 -0.231204 -0.363583 -0.622599 -0.414593 0.008344 -0.143423 -0.251885 -0.441335 0.185630 -0.276599 -0.722622 -0.736320 0.139790 0.209616 0.179797 0.228134 0.203381 0.215297 0.291562 0.277058 0.226173 0.280625 0.367113 0.294405 0.217262 0.211712 0.207449 0.202549 0.209627 0.262252 0.326290 0.266443 0.383637 0.387465 0.385436
chargesum: 0.00000
title: Mulliken charges with hydrogens summed into heavy atoms:
elementType: O O O O O O O N N C C C C C C C C C C C C
charge: -0.291320 -0.036288 -0.225217 -0.010823 -0.015901 -0.226799 -0.231204 0.003530 -0.029866 0.016923 0.223641 0.148139 0.025174 0.065464 0.185630 0.017806 -0.086200 -0.061892 0.139790 0.209616 0.179797
polarizability: 1.88196559e+02 4.05639579e+00 1.64468560e+02 -3.12372504e-01 -8.62891274e+00 1.42849837e+02
1716.lowfreq: -7.2118 -3.1409 -0.0004 0.0004 0.0006 6.9423 13.3990 17.9616 24.5996
frequency: 13.2907 17.4662 24.3370 39.4726 43.1457 51.1465 61.3704 67.7888 68.5716 82.5614 108.5484 124.8323 147.7510 163.0171 183.0413 218.0321 229.0901 236.6315 254.7146 266.0732 286.5996 305.1006 348.4944 366.2153 372.7304 398.0631 405.7607 420.0803 446.2718 454.8753 484.0118 506.9908 544.8603 569.1649 577.5293 588.2540 610.6358 613.2467 640.4237 689.9358 691.7090 703.9847 756.7399 788.2632 805.8603 818.2739 835.3998 838.0629 851.0528 879.0516 912.7518 924.7174 948.7590 954.9815 963.8600 992.5472 1012.7999 1043.0924 1060.3947 1075.3680 1093.7025 1114.6011 1119.3423 1131.8684 1147.0830 1170.0142 1178.7496 1202.1992 1209.6533 1227.4360 1232.3220 1261.8269 1264.1890 1279.7075 1295.1842 1303.2535 1309.1455 1319.7858 1337.4249 1339.0532 1352.8674 1359.6670 1377.8901 1380.2965 1398.9945 1453.0161 1454.0944 1469.2022 1473.7125 1482.4121 1485.4189 1498.8558 1607.6269 1649.1586 1656.8655 1658.1668 1666.7912 2966.1005 2968.3878 2973.7586 2977.7297 2995.7465 3004.4549 3019.3553 3043.5774 3045.0015 3059.2117 3065.4413 3068.8519 3071.6967 3073.3807 3383.7597 3419.8904 3511.5997 3516.1428 3517.3873 3540.2696
redmass: 5.8780 6.2898 7.4287 6.4625 8.3161 3.0718 6.0263 7.6283 7.2553 4.8291 5.7898 3.6437 5.8795 5.0987 4.4336 1.1612 2.9234 1.6541 2.3524 4.0004 3.5776 3.6963 2.6319 3.3353 2.1838 2.1231 2.3296 2.1949 3.0027 3.5906 3.8543 3.4189 4.1989 3.0869 2.4509 2.9805 1.5605 1.4142 2.1321 3.8327 2.8455 4.5619 4.4115 1.7471 2.9370 2.4709 1.8678 2.1517 1.6906 3.1909 3.7015 1.1754 2.5006 1.5098 2.0319 2.1551 3.0847 3.0929 2.5607 2.2280 2.4939 2.3397 2.1877 2.2509 1.5556 2.1696 1.7848 1.5239 1.5440 1.3048 1.3670 1.3025 1.3439 1.4712 1.5503 1.3928 1.8453 1.5484 1.4375 1.4756 1.9686 1.4082 1.3762 1.2064 1.2034 1.1118 1.1099 1.0750 1.0516 1.1031 1.9165 1.0462 8.8338 3.5159 1.6452 9.1519 3.9717 1.0359 1.0398 1.0599 1.0800 1.0741 1.0691 1.0823 1.0828 1.1002 1.0994 1.0991 1.1034 1.0996 1.0993 1.0770 1.0463 1.0639 1.0642 1.0641 1.0954
irintensity: 0.4271 0.1242 1.9977 3.9025 0.7043 1.2978 2.3494 5.6810 0.3795 0.0444 0.9119 2.5358 0.3587 2.7937 4.5380 0.3273 0.9265 0.8863 0.6590 3.3032 1.9683 24.2196 4.9622 8.1665 4.3926 4.5373 23.7089 1.6445 40.1796 5.6294 0.3705 15.9544 22.2328 42.5486 107.7285 44.1039 79.9561 120.4713 94.1097 41.7749 63.0888 25.6562 23.5361 174.3109 6.5693 17.1852 49.4162 89.3382 40.5210 50.9732 39.7264 6.5908 36.8819 2.5644 6.1758 1.0660 32.7091 193.9441 297.9894 184.5687 64.7493 11.4759 34.4603 1.2256 9.4237 32.6169 12.0587 8.9966 6.6569 8.8095 3.9372 12.3460 3.1702 7.7420 26.7723 13.9597 27.8696 12.0448 1.4732 0.8500 61.0197 19.9188 27.3744 17.7880 22.6259 35.9387 35.6137 33.0658 9.9341 24.0905 285.2813 20.6894 167.4190 157.4244 74.7337 239.3269 229.3074 28.3158 31.1214 29.9877 25.4570 2.9244 21.6679 9.8392 6.8517 12.8910 14.4198 59.0396 5.3366 38.8159 48.5273 143.3764 3.0982 25.9143 40.5642 33.9026 15.8232
temp: 298.150 k
press: 1.00000 atm
elementType: 8 8 8 8 8 8 8 7 7 6 6 6 6 6 6 6 6 6 6 6 6 1 1 1 1 1 1 1 1 1 1 1 1 1 1 1 1 1 1 1 1
symmnumber: 1
zpe: 855755.3 jmol-1
zpe.correction: 0.325940 hartree
zpe.thermalcorrener: 0.349624 hartree
zpe.thermalcorrenthalpy: 0.350568 hartree
zpe.thermalcorrgfe: 0.268465 hartree
zpe.sumelectzpe: -1103.739280 hartree
zpe.sumelectthermal: -1103.715596 hartree
zpe.sumelectthermalent: -1103.714652 hartree
zpe.sumelectthermalfe: -1103.796755 hartree
dipole: 3.0867 -2.1289 1.4918
dipole: 4.0355
quadrupole: -119.5900 -111.2455 -129.7364
quadrupole: -1.1998 -5.8424 -2.2071
quadrupole: 0.6006 8.9451 -9.5458 -1.1998 -5.8424 -2.2071
hfenergy: -1104.0652197 hartree
pointgroup: C01 [X(C12H20N2O7)]
dipole: 1.1311903 0.6870318 -0.8770282 debye
polarizability: 188.7424507|-1.3852371|155.9642255|1.5722911|-13.3318517|150.8082795 unknown
InChI: InChI=1S/C12H20N2O7/c1-5(2)3-8(12(20)21)14-9(15)7(13)4-6(10(16)17)11(18)19/h5-8,14,16,18,20H,3-4,13H2,1-2H3
charge 0 multiplicity 1
41 atoms
O  -0.149507 0.21273 1.461498
O  -3.193652 2.405344 -1.017873
O  -4.793208 1.512503 0.40578
O  3.638744 -0.728685 2.108268
O  5.479525 0.260315 -1.120759
O  3.088565 -1.688977 0.063082
O  3.641629 1.103598 -2.251037
N  -1.374451 0.531686 -0.50894
N  0.665253 1.564486 -1.844967
C  -3.349666 -1.034374 -0.463696
C  -2.544247 -2.323123 -0.157759
C  -2.68564 0.273315 0.075176
C  1.049464 0.810727 -0.627589
C  2.158532 1.451699 0.267779
C  -0.213941 0.502373 0.22243
C  3.545525 0.745034 0.21377
C  -3.212424 -3.524705 -0.868417
C  -2.413737 -2.583426 1.362383
C  -3.664318 1.431174 -0.123511
C  3.412507 -0.687252 0.736078
C  4.169546 0.733957 -1.180028
H  -4.358989 -1.111586 -0.014576
H  -3.484012 -0.935379 -1.560432
H  -1.52401 -2.198553 -0.575395
H  -2.533178 0.168002 1.166552
H  1.402484 -0.18045 -0.976091
H  2.298044 2.507211 -0.030274
H  1.822972 1.42867 1.320665
H  -1.252251 0.845578 -1.485136
H  4.244438 1.27307 0.88708
H  -2.634495 -4.451879 -0.699788
H  -3.284075 -3.362805 -1.96061
H  -4.236578 -3.690809 -0.481495
H  -3.412112 -2.631612 1.839913
H  -1.906305 -3.54883 1.545048
H  -1.819315 -1.799416 1.864481
H  1.405658 1.510171 -2.555395
H  0.428172 2.545418 -1.643235
H  -3.892097 3.107811 -1.120883
H  3.439379 -1.640532 2.455267
H  5.87047 0.222922 -2.035663
