program: Gaussian 09
title: 000191651
version: EM64L-G09RevD.01
frameworkgroup: C1[X(C6H10N2O2S)]
method: RPBEPBE
basis: SDD
operation: Freq
keyword: #p
keyword: freq=noraman
keyword: PBEPBE/SDD
title: #p freq=noraman PBEPBE/SDD
converged: YES YES NO NO
title: Mulliken charges:
elementType: S O O N N C C C C C C H H H H H H H H H H
charge: 0.152652 -0.266760 -0.277511 -0.118121 -0.578220 -0.182268 -0.729155 -0.592080 0.233415 0.246332 -0.789479 0.282311 0.294161 0.290198 0.289553 0.306711 0.230275 0.284884 0.264176 0.334604 0.324322
chargesum: 0.00000
title: Mulliken charges with hydrogens summed into heavy atoms:
elementType: S O O N N C C C C C C
charge: 0.152652 -0.266760 -0.277511 -0.118121 0.080706 0.100042 -0.144796 0.004185 0.233415 0.246332 -0.010144
polarizability: 1.12573354e+02 1.73383697e+00 9.98165698e+01 1.49592022e+00 8.49066677e+00 7.99218782e+01
1716.lowfreq: -19.2224 -12.8601 -0.0020 -0.0015 -0.0014 8.5593 10.7336 76.8556 78.5977
frequency: -16.0890 76.8114 78.5876 141.1147 145.9089 169.0390 198.3367 247.4468 301.6829 336.3961 362.0970 467.7525 500.2607 541.6350 569.9166 607.0076 610.2395 655.0035 692.7652 701.4592 733.1344 780.5856 851.5661 915.0682 945.2088 962.0518 1017.3194 1038.8034 1054.3830 1082.2891 1128.2462 1153.4748 1173.1818 1224.1939 1283.9290 1294.7159 1300.3919 1354.9856 1359.6672 1390.6392 1450.9264 1457.7961 1473.3847 1478.7218 1581.0682 1588.2054 1640.3969 2985.8006 3032.2517 3046.6531 3064.4221 3075.1458 3107.9362 3129.5834 3130.6536 3389.3506 3611.0323
redmass: 3.2066 5.5092 9.4863 3.1687 1.0413 6.0622 3.8674 3.6318 3.9296 4.7898 6.8894 4.1582 4.3148 3.4148 2.9084 1.4097 5.0088 4.1972 1.2489 4.8609 3.4726 2.6580 5.3940 1.3250 1.6530 2.4774 2.3966 1.6968 1.8906 1.7616 1.5186 1.1968 2.1174 1.4202 1.5389 1.3891 1.5737 3.5667 2.4667 1.3074 1.0960 1.0983 1.0555 1.0786 1.4250 6.2465 4.0252 1.0393 1.0567 1.0606 1.0834 1.0965 1.1090 1.1086 1.0991 1.0550 1.0960
irintensity: 1.1131 3.7129 5.0439 11.9931 0.5546 4.6559 6.5108 2.3894 16.2601 1.1396 5.5811 0.8390 4.4965 17.4375 7.4291 143.8067 0.4178 15.7005 91.9322 1.2686 2.3830 1.9394 4.3052 0.4045 12.5897 8.3276 1.9803 7.4230 14.5956 5.2327 10.9249 10.2284 8.9054 0.3709 77.0566 10.6131 84.7822 42.6724 178.2712 87.2472 11.1388 27.0807 31.5277 5.4380 155.8233 189.7372 288.4015 6.2713 15.0917 10.8448 10.0636 4.3952 5.8305 5.2887 5.7625 115.5305 79.7617
temp: 298.150 k
press: 1.00000 atm
elementType: 16 8 8 7 7 6 6 6 6 6 6 1 1 1 1 1 1 1 1 1 1
symmnumber: 1
zpe: 428805.2 jmol-1
zpe.correction: 0.163323 hartree
zpe.thermalcorrener: 0.174024 hartree
zpe.thermalcorrenthalpy: 0.174968 hartree
zpe.thermalcorrgfe: 0.126709 hartree
zpe.sumelectzpe: -891.818665 hartree
zpe.sumelectthermal: -891.807964 hartree
zpe.sumelectthermalent: -891.807020 hartree
zpe.sumelectthermalfe: -891.855279 hartree
dipole: -3.4953 0.3224 1.3213
dipole: 3.7506
quadrupole: -76.3769 -86.2975 -65.9731
quadrupole: 0.4119 6.5072 -3.1754
quadrupole: -0.1611 -10.0816 10.2427 0.4119 6.5072 -3.1754
hfenergy: -891.9819881 hartree
pointgroup: C01 [X(C6H10N2O2S1)]
dipole: 1.2780385 -0.5096548 -0.5331341 debye
dipolederiv: -0.1402723 -0.0910162 0.0386642 -0.035839 -0.2345641 -0.0413138 0.0176769 -0.0587048 -0.1823214 -0.5145791 -0.0115188 -0.1263991 0.097304 -1.0369633 0.2325535 -0.1544655 0.0442292 -0.4517697 -1.0292313 0.0141775 0.1923157 -0.1694998 -0.5313117 0.1846226 0.394166 0.1499767 -0.5621542 -1.2826375 0.1699982 0.1672882 0.3475467 -0.524004 -0.0382134 0.1993121 -0.0228279 -0.4065642 -0.8336607 0.2097721 -0.1678973 0.0325133 -0.5572874 0.0650676 -0.254623 0.1866226 -0.7268566 0.3239846 0.0977063 -0.1071093 0.0642626 0.0680855 0.0099824 -0.2164445 0.0949805 0.1788088 -0.032399 0.0371962 0.0165453 0.0025178 0.1001527 -0.120715 0.0231335 -0.1281304 0.2495591 0.3981078 -0.0610904 -0.0629602 -0.1050501 0.3381289 0.0114971 -0.0876118 0.0116109 0.3037881 0.6658841 -0.1324105 0.5416156 -0.1360652 1.1824803 -0.2954634 0.6717551 -0.2036926 0.5801304 1.7755493 -0.2389456 -0.3212008 -0.3205404 0.6231735 -0.2870794 -0.3553769 -0.3156541 0.51531 -0.0961763 0.0597075 -0.0223806 0.1171145 -0.2613085 0.174708 -0.0679467 0.205642 -0.0908607 0.0626968 0.0062102 -0.0657627 0.0018937 0.0018047 0.0812336 -0.0323189 0.0050325 0.0187463 0.0715965 -0.0149059 -0.0973525 -0.0145872 -0.0199429 -0.0087449 -0.04891 -0.024085 -0.085481 -0.047643 -0.0238412 0.0501507 -0.0426222 0.0743188 0.0584328 0.0358687 0.0381131 0.0564598 -0.0175623 0.0303117 0.0169753 0.050941 0.0460348 -0.0484444 -0.0242949 0.0230461 -0.0823517 -0.0282647 -0.0871972 0.013705 0.0088921 -0.0035581 -0.0126818 -0.0119325 0.0006345 0.0651787 0.1206452 0.0136083 0.0184193 0.0085534 0.0591474 -0.0650694 -0.0236007 -0.0272379 -0.0932268 0.079233 -0.0961219 -0.0138602 -0.0503562 0.0472661 0.0079979 -0.0270897 -0.0088935 0.0997719 -0.050032 0.0829212 0.0398941 0.0383901 0.0923869 0.0038396 0.0776436 -0.0213843 0.1016696 0.2907133 -0.0120413 -0.0785104 -0.0112328 0.1244141 -0.0149587 -0.0926767 -0.011413 0.2692398 0.2840477 0.0474799 -0.0321402 0.1158639 0.4115462 0.1027489 -0.0222641 0.0621352 0.242924 unknown
polarizability: 108.9227383|-6.7885691|100.566746|-2.8612008|-10.7789871|82.8223177 unknown
InChI: InChI=1S/C6H10N2O2S/c1-4(9)8-3-11-2-5(8)6(7)10/h5H,2-3,7H2,1H3
charge 0 multiplicity 1
21 atoms
S  1.558867 -2.103596 0.001169
O  1.128307 2.617536 -0.477679
O  -2.601648 -0.400536 0.772981
N  -0.485278 -0.314547 -0.141207
N  2.274889 0.984624 0.72424
C  0.588585 0.277476 -0.976436
C  1.451098 -0.902196 -1.468637
C  -0.143868 -1.532623 0.625685
C  1.36502 1.397967 -0.22276
C  -1.783347 0.193052 0.005639
C  -2.142975 1.442576 -0.787565
H  0.136509 0.78827 -1.842942
H  0.967272 -1.421929 -2.309813
H  2.473835 -0.6027 -1.742584
H  -0.058996 -1.333234 1.706572
H  -0.901436 -2.311405 0.454053
H  -2.231018 1.212881 -1.86686
H  -1.392982 2.244038 -0.670477
H  -3.121089 1.796452 -0.430257
H  2.778434 1.693662 1.258181
H  2.429423 -0.01547 0.904501
