program: Gaussian 09
title: 000191675
version: EM64L-G09RevD.01
frameworkgroup: C1[X(C20H32O)]
method: RPBEPBE
basis: SDD
operation: Freq
keyword: #pfreq=noraman
keyword: PBEPBE/SDD
title: #p freq=noraman PBEPBE/SDD
converged: YES YES NO NO
title: Mulliken charges:
elementType: O C C C C C C C C C C C C C C C C C C C C H H H H H H H H H H H H H H H H H H H H H H H H H H H H H H H H
charge: -0.458351 0.311227 -0.263067 -0.049002 -0.211753 -0.514403 -0.452259 -0.076209 0.396966 -0.783031 -0.252024 -0.449202 -0.775676 -0.443542 -0.260948 -0.844549 -0.475854 -0.304023 0.366640 -0.785884 -0.801310 0.196274 0.262126 0.222102 0.221487 0.192802 0.205949 0.208643 0.240795 0.210119 0.217049 0.232048 0.233822 0.222279 0.191400 0.209723 0.235611 0.209710 0.223841 0.329659 0.215108 0.222799 0.231756 0.229537 0.209574 0.218956 0.211009 0.213557 0.228098 0.212773 0.217254 0.209682 0.240714
chargesum: 0.00000
title: Mulliken charges with hydrogens summed into heavy atoms:
elementType: O C C C C C C C C C C C C C C C C C C C C
charge: -0.128692 0.311227 -0.066793 0.213124 0.010348 -0.100114 -0.037667 0.164585 0.396966 -0.123815 -0.018202 -0.035523 -0.120632 -0.219701 -0.045840 -0.160456 -0.047324 -0.093014 0.366640 -0.131457 -0.133660
polarizability: 2.33667159e+02 -2.11446318e+01 2.19195952e+02 6.37824627e+00 -3.45918405e+00 1.85512011e+02
1716.lowfreq: -15.0223 -11.4967 -6.6632 -0.0007 -0.0006 0.0007 15.4953 26.3784 34.0108
frequency: 12.1875 25.2719 33.7220 53.6007 70.4108 78.4668 100.5114 129.6580 135.3598 158.4252 165.3164 175.4659 185.7791 190.0313 197.4396 215.0108 227.2240 249.5681 259.2526 263.7953 272.5797 280.8162 287.6031 305.4219 321.2291 355.5283 375.7321 393.5659 398.0555 412.5490 453.1743 475.4332 483.0292 491.7095 503.9366 520.4350 562.5965 581.7394 637.2006 667.8793 709.2465 738.0440 747.1718 762.7193 796.8677 809.5147 829.2980 860.1479 868.5545 878.4331 894.7761 914.1608 928.9259 944.1983 946.0722 950.8359 959.7102 965.8430 976.7644 981.1343 994.8029 1006.5280 1019.1147 1022.6795 1035.2843 1052.2857 1062.7688 1071.7421 1080.8005 1086.5061 1088.7350 1100.8362 1120.4643 1127.6464 1146.5925 1160.1083 1172.7537 1178.2621 1188.1244 1195.3940 1216.5635 1228.5250 1244.3152 1256.7937 1264.7253 1274.6200 1281.1029 1286.7079 1306.2290 1314.9362 1321.4520 1327.4294 1336.3324 1342.9929 1347.7749 1353.0667 1359.0607 1371.2304 1378.9171 1383.9924 1385.6197 1393.0791 1395.2480 1396.2426 1454.6755 1457.2799 1457.6322 1461.0461 1465.0642 1466.5544 1468.6291 1470.5569 1474.0635 1474.5679 1475.3141 1477.6516 1482.5282 1489.6251 1615.3199 1661.8979 1694.5898 2930.8435 2951.6446 2952.9182 2957.6734 2960.5809 2961.2521 2965.6994 2968.8478 2972.0401 2975.0269 2978.0919 2989.6960 2992.8858 3017.8138 3018.3243 3021.8904 3025.4306 3030.6135 3040.6922 3052.4835 3057.0960 3060.1740 3061.4360 3072.6998 3074.2383 3074.3724 3077.6557 3089.4316 3094.0004 3108.0237 3138.0206 3558.4930
redmass: 2.6758 3.8488 3.8650 3.3336 3.3731 3.2983 2.7127 2.5205 1.0659 2.8178 2.5430 1.3132 1.8201 1.4470 1.9446 1.3835 2.7683 1.0603 2.8674 1.4366 1.9760 2.1005 2.5093 2.6970 2.8061 3.1074 2.4627 2.4452 2.4695 2.4884 2.3297 4.1766 3.2736 3.9706 3.2397 2.9669 3.2657 2.7949 3.7490 4.1022 2.8011 1.4106 1.5532 2.0988 2.0285 2.3863 1.7403 2.0096 2.5188 1.5488 2.0191 1.8350 2.6246 1.9187 1.5676 1.6370 2.2726 1.3654 1.6849 2.1547 1.2559 1.8389 1.8231 2.3420 1.5957 2.3806 1.7811 2.0940 1.6729 1.8018 2.0847 2.2103 1.7172 2.2945 1.5377 1.7963 1.5507 1.4254 1.4637 2.0609 1.5467 1.8601 1.2907 1.5275 1.4172 1.2853 1.2221 1.6036 1.3245 1.3296 1.4343 1.3853 1.4339 1.4664 1.5108 1.3695 1.4329 1.2972 1.5875 1.2419 1.2983 1.4424 1.2623 1.2879 1.0501 1.0671 1.0670 1.0603 1.0675 1.0695 1.0612 1.0629 1.0716 1.0504 1.0800 1.0644 1.0750 1.0677 7.8771 6.0606 6.4975 1.0822 1.0385 1.0377 1.0403 1.0615 1.0356 1.0678 1.0817 1.0381 1.0598 1.0777 1.0653 1.0817 1.0943 1.0939 1.0968 1.0964 1.1007 1.0959 1.1018 1.0988 1.0978 1.0927 1.0998 1.0976 1.0977 1.0971 1.0954 1.0849 1.0911 1.0990 1.0662
irintensity: 0.0407 0.0143 0.0043 0.1614 0.2860 0.2057 0.4967 0.7396 0.1144 0.4671 0.2877 0.3569 1.2190 0.2145 0.1906 0.0760 1.9799 0.2651 26.4179 44.4680 20.4965 36.7629 1.2853 14.6093 2.0674 0.2392 0.3301 2.8354 0.4825 3.9595 3.5864 0.3465 1.1843 3.1723 0.8002 2.2805 0.2264 3.6905 10.3708 6.7296 15.1861 62.6671 12.6922 7.3869 1.9620 9.1707 6.1014 4.5452 4.6542 7.8859 11.3049 1.8104 33.8926 2.0737 0.4915 0.7358 17.3972 0.6396 1.6607 6.0956 4.5576 9.9645 2.2220 5.2992 7.8157 0.8055 13.7353 15.2002 4.3222 7.2115 8.2081 9.8133 1.8749 8.8247 2.7444 17.2426 8.9491 13.8927 15.7911 8.8414 1.1397 1.2487 1.1238 19.5469 0.3869 10.7455 3.3268 0.4620 0.7131 1.2679 2.9886 1.2049 1.1867 2.6081 4.5361 5.9849 2.9773 10.8791 4.0212 29.3316 20.2659 4.6375 12.3251 4.8975 8.4523 8.5317 16.7970 5.5673 1.0680 19.6782 15.8079 7.5746 9.7337 6.0951 6.6202 1.8803 3.5837 24.6254 3.6621 5.3495 1.5583 29.5141 40.5029 32.5529 69.0323 4.2419 33.1809 28.6900 48.8381 29.8345 50.1234 40.5774 65.0020 13.1305 35.0366 14.2485 2.2431 56.5214 8.7288 31.6283 9.0661 43.0722 40.7391 69.8911 25.3358 7.7207 62.1331 51.2359 40.7166 2.4252 33.4152 37.4962 3.8372
temp: 298.150 k
press: 1.00000 atm
elementType: 8 6 6 6 6 6 6 6 6 6 6 6 6 6 6 6 6 6 6 6 6 1 1 1 1 1 1 1 1 1 1 1 1 1 1 1 1 1 1 1 1 1 1 1 1 1 1 1 1 1 1 1 1
symmnumber: 1
zpe: 1229908.2 jmol-1
zpe.correction: 0.468447 hartree
zpe.thermalcorrener: 0.492379 hartree
zpe.thermalcorrenthalpy: 0.493323 hartree
zpe.thermalcorrgfe: 0.414800 hartree
zpe.sumelectzpe: -854.848066 hartree
zpe.sumelectthermal: -854.824134 hartree
zpe.sumelectthermalent: -854.823190 hartree
zpe.sumelectthermalfe: -854.901713 hartree
dipole: 0.0263 -1.6829 0.6102
dipole: 1.7903
quadrupole: -130.9155 -131.1515 -126.6745
quadrupole: -1.6590 0.7500 -4.6432
quadrupole: -1.3350 -1.5710 2.9060 -1.6590 0.7500 -4.6432
hfenergy: -855.3165131 hartree
pointgroup: C01 [X(C20H32O1)]
dipole: -0.0250308 0.6520048 -0.2652834 debye
polarizability: 231.3259518|21.6452113|221.344636|-6.4875694|-4.9433942|185.7045341 unknown
InChI: InChI=1S/C20H32O/c1-14(2)8-6-9-15(3)17-11-13-20(5)12-7-10-16(4)18(20)19(17)21/h7-8,10,12,15,17-19,21H,6,9,11,13H2,1-5H3
charge 0 multiplicity 1
53 atoms
O  -1.104583 -1.286644 -2.298143
C  -2.925325 0.272741 0.096906
C  -1.742452 0.692266 -0.850416
C  -0.597976 -1.443632 0.068278
C  -0.714662 -0.470163 -1.121534
C  -3.183043 -1.250064 -0.087114
C  -1.975156 -2.124759 0.339545
C  0.54413 -2.49043 -0.113372
C  -0.989633 1.944743 -0.388327
C  -4.2049 1.067071 -0.300799
C  -2.639342 0.591267 1.563986
C  1.933265 -1.856938 -0.423265
C  0.634218 -3.432143 1.115461
C  -0.981423 2.301439 0.934356
C  -1.748786 1.553737 1.941892
C  -0.260147 2.739119 -1.450321
C  2.463472 -0.85042 0.637634
C  3.865367 -0.373899 0.31651
C  4.306139 0.903963 0.125659
C  5.76731 1.183741 -0.195625
C  3.432386 2.144277 0.213155
H  -2.19882 0.924755 -1.838909
H  -0.351196 -0.809968 0.944003
H  0.274747 -0.011561 -1.324841
H  -3.398436 -1.433974 -1.15639
H  -4.085285 -1.541579 0.487244
H  -2.04513 -2.367191 1.416616
H  -2.021984 -3.083693 -0.210543
H  0.27305 -3.104581 -0.997075
H  -4.510931 0.809591 -1.334122
H  -5.047259 0.826756 0.374214
H  -4.025988 2.156501 -0.248509
H  -3.234003 0.048158 2.312013
H  1.911034 -1.356178 -1.410438
H  2.669112 -2.681951 -0.523691
H  0.79196 -2.864382 2.052494
H  -0.286401 -4.028798 1.24029
H  1.477296 -4.139834 1.002996
H  -0.403696 3.177033 1.259181
H  -1.106285 -0.704177 -3.09932
H  -1.607755 1.80146 3.001074
H  0.408143 2.097943 -2.059917
H  0.353433 3.545607 -1.012427
H  -0.978304 3.203682 -2.156694
H  2.472825 -1.350925 1.628458
H  1.767661 0.003269 0.728905
H  4.609451 -1.182423 0.220498
H  6.225172 1.842113 0.570134
H  6.360641 0.254146 -0.246255
H  5.868966 1.710705 -1.165906
H  3.78429 2.811908 1.025498
H  3.496365 2.73113 -0.725545
H  2.370767 1.914885 0.401195
