program: Gaussian 09
title: 000191630
version: EM64L-G09RevD.01
frameworkgroup: C1[X(C6H5NO7S)]
method: RPBEPBE
basis: SDD
operation: Freq
keyword: #p
keyword: freq=noraman
keyword: PBEPBE/SDD
title: #p freq=noraman PBEPBE/SDD
converged: YES YES NO NO
title: Mulliken charges:
elementType: S O O O O O O O N C C C C C C H H H H H
charge: 1.130808 -0.322211 -0.398164 -0.533636 -0.480109 -0.452137 -0.177889 -0.236878 0.037329 0.138747 0.366560 -0.222097 -0.493719 0.334987 -0.321825 0.275622 0.284340 0.276628 0.377674 0.415971
chargesum: 0.00000
title: Mulliken charges with hydrogens summed into heavy atoms:
elementType: S O O O O O O O N C C C C C C
charge: 1.130808 -0.322211 -0.020490 -0.117665 -0.480109 -0.452137 -0.177889 -0.236878 0.037329 0.138747 0.366560 0.053525 -0.209380 0.334987 -0.045198
polarizability: 2.70785935e+02 -4.25968248e+00 1.43012455e+02 -3.75020220e+00 4.98855036e+00 7.13178003e+01
1716.lowfreq: -7.2162 -0.0028 -0.0026 -0.0018 3.6277 8.4919 14.9080 37.8512 51.3605
frequency: 13.9744 37.8338 51.3270 96.0827 101.0883 113.7755 152.5994 162.7014 213.2803 245.7143 283.8013 308.5897 321.4508 356.6018 373.7144 399.6868 410.9475 433.6092 444.1768 467.9619 525.4609 549.5173 571.8598 575.0299 655.9846 683.3475 735.1547 751.1378 793.0863 845.6055 853.1843 877.7021 918.7506 962.6332 977.3718 1052.5508 1115.0501 1141.9841 1167.8705 1208.3213 1226.5156 1237.7643 1291.4023 1362.0370 1372.4182 1444.8999 1467.7036 1546.5164 1608.0457 3154.6092 3167.3218 3187.9653 3247.7699 3573.3599
redmass: 11.4347 11.1977 10.8085 10.3052 6.1520 11.4042 8.4524 8.3843 9.9899 8.2607 8.8947 10.9844 11.7351 11.0062 6.6975 6.3452 5.4147 1.1436 6.2847 9.4932 1.1467 3.7099 4.4555 15.6803 7.8343 6.3444 3.9732 11.1717 5.7912 2.6816 3.1358 1.5765 5.6950 10.8967 1.3714 2.7469 1.5615 1.2901 1.4432 3.5828 1.6154 4.6038 2.6809 5.4358 3.8730 5.5258 3.4447 6.1223 6.3131 1.0922 1.0893 1.0982 1.0662 1.0664
irintensity: 0.6743 0.6011 1.7376 3.5600 3.2172 3.6933 8.6227 1.7437 5.9782 18.9850 7.0344 6.7313 7.2087 28.5583 16.1997 7.3737 27.9386 145.8917 3.8764 17.1454 146.9724 1.7421 4.6563 134.2488 4.0210 2.7770 2.4174 26.5703 4.2834 19.2798 114.9164 42.2043 6.1628 61.4410 0.8773 5.7938 115.8106 316.8443 178.5870 133.6258 27.8421 91.7269 43.2348 42.2521 112.3201 12.2497 78.5424 27.4520 253.0924 4.4197 0.1765 1.5025 121.1745 152.3886
temp: 298.150 k
press: 1.00000 atm
elementType: 16 8 8 8 8 8 8 8 7 6 6 6 6 6 6 1 1 1 1 1
symmnumber: 1
zpe: 304083.8 jmol-1
zpe.correction: 0.115819 hartree
zpe.thermalcorrener: 0.130853 hartree
zpe.thermalcorrenthalpy: 0.131797 hartree
zpe.thermalcorrgfe: 0.071484 hartree
zpe.sumelectzpe: -1209.617986 hartree
zpe.sumelectthermal: -1209.602953 hartree
zpe.sumelectthermalent: -1209.602009 hartree
zpe.sumelectthermalfe: -1209.662322 hartree
dipole: -7.9666 -0.9908 0.1598
dipole: 8.0296
quadrupole: -91.1687 -97.5814 -96.7140
quadrupole: 2.3866 -3.5192 3.9588
quadrupole: 3.9860 -2.4267 -1.5593 2.3866 -3.5192 3.9588
hfenergy: -1209.7338056 hartree
pointgroup: C01 [X(C6H5N1O7S1)]
dipole: -3.1329117 0.3755839 -0.1536393 debye
dipolederiv: 1.6906384 0.0939617 -0.0347092 -0.2006025 1.342535 -0.0694958 -0.5770183 -0.1905477 1.3332604 0.4948385 -0.123857 -0.0542308 -0.0318946 -0.2690278 0.0209623 -0.1506289 -0.0521445 -0.3682578 -1.8942653 0.1800094 -0.2403947 0.1282617 -0.0610925 0.0339565 -0.5085113 0.0735269 -0.4807793 -0.7012074 -0.010249 0.0179928 0.7002106 -0.8429871 0.0360445 0.0598449 0.0584741 -0.5103122 -0.4198336 -0.0098388 -0.0695544 -0.0191346 -0.386088 -0.0055474 0.5767718 0.0748177 -0.6434666 -0.9973126 -0.1379467 -0.0027327 -0.3061801 -0.4221306 0.0100973 0.1934121 0.0267869 -0.4108104 -0.4827083 -0.2357663 0.0606539 -0.2915836 -0.8207701 0.1033661 0.032897 0.0287865 -0.2140092 -0.6029418 0.1775993 0.0278989 0.0663949 -0.5074716 0.0566977 0.02812 0.078296 -0.2165879 0.8047622 -0.2070474 -0.0929065 0.3263152 1.6466734 -0.2256321 -0.068235 -0.1399986 0.2003845 -0.3238226 0.2302209 0.0914388 -0.0530051 0.1747824 -0.0160778 -0.2246451 0.0345696 0.0512154 0.5551739 0.3130817 0.0072454 0.1449227 -0.5875223 0.0228385 0.2364003 0.0418076 0.1083962 0.2286016 0.0454956 0.0518588 -0.1315767 0.0757114 0.0913841 0.1408243 0.0545532 -0.0404797 -0.7771666 -0.2459595 0.0232134 0.7547704 -0.0123372 0.0463965 -0.1817551 -0.0136269 -0.1323266 1.8045138 -0.1700858 0.3549145 -0.5235676 -0.0667857 0.0190738 0.5657702 -0.0508276 0.2462787 -0.3578659 0.0079484 -0.0191108 -0.4135271 0.1390089 -0.0588727 -0.1212115 0.0205057 -0.1252631 0.0631864 -0.0565332 -0.0370683 -0.0214998 0.0431529 -0.0118015 -0.0099965 -0.0194704 0.1306447 0.0585216 -0.0147071 -0.0413448 -0.0314035 0.08116 -0.0264268 -0.0409608 -0.0189221 0.1720301 0.0771301 0.0552738 -0.0208439 0.0534459 0.0309251 0.0041 -0.0344672 -0.0007165 0.161436 0.5491663 -0.0102582 0.0063517 0.0569507 0.086332 -0.0273812 0.0614217 -0.0206432 0.3963069 0.2305913 0.1186581 -0.028672 -0.2072966 0.3559318 -0.0036819 0.0219674 0.0147734 0.3423401 unknown
polarizability: 270.6522267|4.8842681|143.1406974|5.9037781|-3.9803152|71.323266 unknown
InChI: InChI=1S/C6H4NO4.HO3S/c8-4-1-2-6(9)5(3-4)7(10)11;1-4(2)3/h1-3,8H;1H
charge 0 multiplicity 1
20 atoms
S  2.8506 0.662068 -0.216585
O  1.280295 0.57574 1.217832
O  -3.953313 1.067814 -0.689256
O  3.554955 -0.945021 0.17331
O  2.105957 0.672892 -1.652197
O  3.97952 1.742964 0.138464
O  -1.054368 -2.859058 0.545376
O  1.071044 -2.102505 0.360563
N  -0.204343 -1.899285 0.41743
C  0.044149 0.636332 0.669558
C  -0.735173 -0.52323 0.308865
C  -0.593458 1.913404 0.521855
C  -2.070706 -0.412097 -0.118174
C  -2.651801 0.870861 -0.250308
C  -1.90885 2.040216 0.071972
H  -0.00384 2.795104 0.791179
H  -2.631023 -1.327485 -0.337641
H  -2.387158 3.016762 -0.040326
H  -4.41368 0.218569 -0.9078
H  2.751995 -1.551545 0.299683
