program: Gaussian 09
title: 000191689
version: EM64L-G09RevD.01
frameworkgroup: C1[X(C17H24N2O6)]
method: RPBEPBE
basis: SDD
operation: Freq
keyword: #p
keyword: freq=noraman
keyword: PBEPBE/SDD
title: #p freq=noraman PBEPBE/SDD
converged: YES YES NO NO
title: Mulliken charges:
elementType: O O O O O O N N C C C C C C C C C C C C C C C C C H H H H H H H H H H H H H H H H H H H H H H H H
charge: -0.507652 -0.445347 -0.460686 -0.227436 -0.449985 -0.288793 -0.275286 -0.392545 -0.167498 -0.248554 -0.534821 0.340269 -0.080775 -0.439090 0.122743 -0.500722 0.169306 0.148070 -0.426601 -0.349480 -0.576495 -0.306489 0.301526 -0.353951 -0.547748 0.284243 0.283861 0.218226 0.248317 0.223447 0.216182 0.213750 0.245884 0.284499 0.278313 0.267144 0.224292 0.223533 0.308398 0.276608 0.233734 0.395441 0.374473 0.253840 0.371887 0.354957 0.238920 0.264750 0.213340
chargesum: 0.00000
title: Mulliken charges with hydrogens summed into heavy atoms:
elementType: O O O O O O N N C C C C C C C C C C C C C C C C C
charge: -0.112211 -0.070875 -0.088800 -0.227436 -0.095028 -0.288793 0.003027 -0.084147 0.116746 0.035307 -0.068278 0.340269 0.142673 -0.009158 0.122743 0.029661 0.169306 0.148070 -0.159457 0.098345 -0.299886 -0.072755 0.301526 -0.100111 0.169262
polarizability: 2.53721586e+02 2.21569500e+01 1.86836342e+02 1.07845099e+01 -8.53271456e+00 2.01418877e+02
1716.lowfreq: -11.3772 -3.9528 -0.0005 -0.0005 -0.0003 7.3093 21.8656 31.6306 39.7246
frequency: 21.2727 31.4833 39.5656 47.0068 59.6069 64.2345 81.1277 82.7365 112.7106 122.8071 138.3627 144.3830 159.1709 174.8665 184.2494 208.5801 213.3633 224.1283 244.1333 254.3047 272.9278 290.0168 300.8797 304.5548 314.9421 358.1398 378.4050 385.2688 390.8459 415.6304 425.5208 439.1113 456.4949 478.7825 493.7804 496.9123 503.8616 506.0915 526.1663 556.9874 563.6562 593.9479 611.6621 634.1933 660.0831 681.0760 711.5744 734.7960 740.5653 744.2135 783.6430 795.9679 800.9879 805.5478 811.5579 840.0420 848.4271 901.9896 908.1473 916.8637 933.7588 944.4501 959.4088 966.2674 980.7143 982.3557 984.1966 1020.2159 1044.7898 1045.2991 1058.8792 1098.1147 1098.7469 1123.3393 1125.6270 1135.2196 1146.2972 1158.9190 1160.8967 1182.0387 1194.0606 1198.4905 1215.0782 1228.3283 1236.2067 1248.0247 1254.9469 1271.7788 1279.6703 1289.8049 1296.7431 1301.6102 1313.4541 1321.6472 1335.8191 1337.9556 1338.9319 1353.3203 1361.8491 1376.6147 1392.2772 1405.4927 1411.4004 1422.6949 1438.4574 1451.3451 1455.4136 1459.5679 1467.7269 1472.4848 1474.4748 1480.1460 1491.7270 1548.8524 1583.9176 1609.0689 1626.5013 2946.3910 2948.4087 2957.8345 2971.1675 2983.8730 3003.8544 3022.0864 3036.6411 3044.4691 3044.8388 3053.3217 3072.9471 3090.7598 3127.2814 3142.0294 3164.2849 3172.0282 3219.9273 3348.0342 3415.1050 3467.0024 3473.6712 3559.5368 3614.4303
redmass: 6.6863 6.2370 6.1231 5.2398 5.4005 4.7894 5.6379 6.1045 3.5381 3.2580 3.4651 5.3032 3.1389 3.8012 3.5108 4.6937 5.3158 3.3976 1.2730 2.8329 4.5962 4.5461 2.4045 4.1446 3.2438 1.5873 2.6534 4.2859 1.4200 2.7307 2.8147 2.4703 3.2963 2.6266 3.3921 2.9818 1.8441 1.9356 3.0858 1.9155 2.8493 2.4353 1.9092 4.1895 3.4572 3.8346 4.5223 3.3495 5.4419 1.2705 1.6451 3.0271 2.2815 1.7959 3.1725 2.4610 1.5678 4.1581 2.5841 2.9612 1.3213 3.0316 4.1583 2.8997 2.7610 3.9718 3.7474 3.6758 2.5357 2.1751 2.2241 1.5337 2.4065 1.2747 2.2143 1.2586 1.6427 1.3678 1.7009 1.6076 1.4066 1.9533 1.2319 1.2978 2.5079 1.5505 1.4379 1.1144 1.3869 1.3035 1.6331 2.4596 1.3133 1.4900 1.3180 1.3155 1.3629 1.2070 1.2597 1.2265 5.0610 1.1090 1.5061 1.8300 1.5175 1.3329 1.3775 1.1831 1.4229 1.0818 2.9708 1.1208 1.2002 5.4458 5.9230 9.2578 6.9325 1.0673 1.0841 1.0664 1.0328 1.0621 1.0640 1.0906 1.0952 1.0852 1.0994 1.0856 1.1032 1.1013 1.1012 1.0891 1.0910 1.0960 1.0979 1.0639 1.0670 1.0737 1.0675 1.0663 1.0810
irintensity: 2.6174 0.0463 4.3810 1.8894 1.8256 1.8039 0.9217 3.8505 0.8416 2.0648 9.7324 7.5456 7.8861 8.6250 0.5675 3.9297 16.6843 9.6320 3.9075 8.5953 8.4927 18.1322 12.1094 51.9975 8.5183 31.3560 37.8994 21.9945 151.6351 23.7834 7.8864 11.1432 2.9562 15.3680 4.2032 8.8243 84.0637 36.7975 4.1859 31.8342 4.8171 36.8920 162.9319 9.2541 4.7653 26.3054 28.8464 21.7486 10.2999 165.6570 26.3128 31.2328 28.2476 4.5934 22.9822 8.7043 41.1034 17.5518 3.9818 18.4726 0.1275 17.3845 132.6313 23.3619 7.0639 39.0440 43.5016 96.3535 15.6886 19.0803 9.6002 20.5561 1.2556 4.3525 35.0860 4.2145 9.9130 3.3762 42.4534 43.8170 48.9372 59.8143 31.4591 13.6500 26.7136 3.2782 12.9843 1.3146 7.5735 17.6514 3.2649 15.6696 26.1314 20.4449 15.8007 7.9676 3.1616 6.3065 8.4543 88.9644 15.5658 48.9017 33.5671 25.6974 20.6767 19.7118 4.5019 43.0710 6.9062 8.5183 94.2531 28.0775 15.0381 1.6291 28.5503 48.7027 35.6316 27.8664 42.1936 25.7383 52.5066 54.1827 55.6571 4.1269 24.3189 0.9582 44.7098 1.1197 22.4062 24.7547 25.3785 8.1579 2.5305 6.8412 1.1212 53.3629 100.4846 2.7967 281.7530 11.5633 72.1870
temp: 298.150 k
press: 1.00000 atm
elementType: 8 8 8 8 8 8 7 7 6 6 6 6 6 6 6 6 6 6 6 6 6 6 6 6 6 1 1 1 1 1 1 1 1 1 1 1 1 1 1 1 1 1 1 1 1 1 1 1 1
symmnumber: 1
zpe: 1040557.9 jmol-1
zpe.correction: 0.396328 hartree
zpe.thermalcorrener: 0.421922 hartree
zpe.thermalcorrenthalpy: 0.422866 hartree
zpe.thermalcorrgfe: 0.340723 hartree
zpe.sumelectzpe: -1221.090471 hartree
zpe.sumelectthermal: -1221.064877 hartree
zpe.sumelectthermalent: -1221.063932 hartree
zpe.sumelectthermalfe: -1221.146076 hartree
dipole: -3.0014 3.8465 -1.7816
dipole: 5.1940
quadrupole: -145.7978 -161.0852 -138.2164
quadrupole: 1.3420 8.2593 -9.0047
quadrupole: 2.5687 -12.7187 10.1501 1.3420 8.2593 -9.0047
hfenergy: -1221.4867987 hartree
pointgroup: C01 [X(C17H24N2O6)]
dipole: 1.9841985 0.4167286 0.2552257 debye
polarizability: 190.6611852|6.9930654|202.0412743|26.5223244|-14.0956705|249.2743449 unknown
InChI: InChI=1S/C17H24N2O6/c1-25-11-2-3-13-12(6-11)10(7-19-13)4-5-18-8-14(21)16(23)17(24)15(22)9-20/h2-3,6-7,15-20,22-24H,4-5,8-9H2,1H3
charge 0 multiplicity 1
49 atoms
O  -0.847908 1.909006 0.487787
O  -2.670537 1.264553 2.194239
O  -3.988654 2.25822 -0.136991
O  -1.497956 -1.947451 0.84749
O  -2.48477 0.256221 -2.905906
O  0.578626 0.03421 -3.691405
N  -0.152691 -2.06908 3.331857
N  2.848078 1.701379 1.132397
C  -1.828913 0.952627 -0.080791
C  -2.471876 0.244533 1.150511
C  1.815806 -1.88476 1.624737
C  2.074274 -0.460234 1.178519
C  -2.865044 1.730845 -0.917809
C  1.304884 -2.060576 3.100395
C  1.822152 0.103601 -0.141108
C  -0.935603 -0.883951 2.982047
C  -1.60726 -0.943032 1.604508
C  2.314359 1.458417 -0.139018
C  2.701202 0.549339 1.918471
C  -3.49515 0.841673 -2.011568
C  1.230773 -0.425457 -1.327562
C  2.241246 2.284911 -1.287093
C  1.150526 0.408248 -2.462562
C  1.654563 1.749128 -2.443235
C  0.103217 -1.352275 -3.817963
H  -1.323628 0.221324 -0.734905
H  -3.477118 -0.130764 0.887506
H  2.758347 -2.46283 1.523421
H  1.083345 -2.365777 0.95021
H  -2.313732 2.574086 -1.39018
H  1.682221 -3.026915 3.484622
H  1.752246 -1.276495 3.742025
H  -0.301024 0.022549 3.02988
H  -1.751946 -0.704438 3.715433
H  -0.594241 -2.926788 2.977817
H  3.067964 0.530125 2.943196
H  -4.241834 1.438986 -2.569812
H  -4.007887 -0.023256 -1.559318
H  3.26095 2.577867 1.442395
H  0.841451 -1.447262 -1.337702
H  2.624404 3.310762 -1.283828
H  0.078393 1.64172 0.244819
H  -1.852931 1.844347 2.126812
H  1.57192 2.339901 -3.36026
H  -3.735659 2.284344 0.828965
H  -1.973723 0.967425 -3.369637
H  -0.231836 -1.443693 -4.861576
H  -0.749614 -1.533199 -3.139375
H  0.924488 -2.068607 -3.622654
