program: Gaussian 09
title: 000191626
version: EM64L-G09RevD.01
frameworkgroup: C1[X(C9H12N3O6PS)]
method: RPBEPBE
basis: SDD
operation: Freq
keyword: #p
keyword: freq=noraman
keyword: PBEPBE/SDD
title: #p freq=noraman PBEPBE/SDD
converged: YES YES NO NO
title: Mulliken charges:
elementType: S P O O O O O O N N N C C C C C C C C C H H H H H H H H H H H H
charge: 0.125345 1.106051 -0.291472 -0.434422 -0.647931 -0.417374 -0.545932 -0.234623 -0.227027 -0.039982 -0.615396 -0.050664 -0.767680 -0.143395 0.015249 -0.326826 -0.039624 0.081461 -0.383762 0.189293 0.271684 0.323946 0.311841 0.337618 0.190577 0.235163 0.251115 0.443999 0.364386 0.241373 0.350032 0.326980
chargesum: 0.00000
title: Mulliken charges with hydrogens summed into heavy atoms:
elementType: S P O O O O O O N N N C C C C C C C C C
charge: 0.125345 1.106051 -0.291472 -0.434422 -0.203932 -0.052989 -0.545932 -0.234623 -0.227027 -0.039982 0.061616 0.221020 -0.443734 0.168446 0.352866 0.098914 0.211491 0.081461 -0.142390 0.189293
polarizability: 2.60855591e+02 -4.39603129e+00 1.40818668e+02 1.91753502e+01 -8.45914276e+00 1.45430974e+02
1716.lowfreq: -9.5505 -3.0268 -0.0016 -0.0014 0.0009 10.2210 25.0510 31.2691 40.7175
frequency: 24.9546 30.8079 40.7032 71.4961 99.0869 122.5710 131.8093 157.3535 166.7605 185.3478 197.9826 220.8973 231.8136 257.4273 280.0347 289.8552 318.8847 336.0231 345.5603 375.9708 403.9402 412.2275 435.7360 449.1260 462.0900 515.2343 533.6754 538.9535 565.1074 577.8873 591.2513 594.1325 681.9783 684.1061 694.3997 726.0884 734.0569 739.5035 758.1975 768.1433 776.9025 784.2121 831.0415 861.9015 889.6697 891.9640 931.6316 945.6410 973.6533 990.3866 1011.1995 1032.4856 1036.9744 1061.8248 1080.7675 1085.1546 1164.5063 1180.8442 1184.3710 1191.6250 1199.7248 1221.8783 1239.3582 1242.3864 1261.7383 1292.0201 1307.8187 1308.6820 1348.2193 1357.4135 1382.5606 1414.4677 1474.6595 1491.1906 1507.2224 1605.0177 1641.9688 1659.9464 2972.2494 3063.8015 3071.8919 3075.2874 3081.4914 3083.7633 3092.8612 3150.8513 3187.0141 3527.4937 3535.0871 3692.2204
redmass: 8.1833 7.3556 8.4597 6.3069 6.7952 6.1825 6.0194 4.6504 9.6951 7.3199 6.9098 5.6467 8.5428 13.0747 6.1488 8.4372 5.6541 6.1988 4.4004 7.8932 11.3797 5.3436 2.1026 1.4608 1.2397 4.1405 6.4842 5.1662 7.7494 6.3506 8.7866 1.2659 6.3738 7.5526 2.6127 6.6352 7.5537 5.7227 2.7061 2.0128 1.7283 3.1807 4.0920 4.1861 4.8906 4.2561 1.3597 6.6876 2.6427 4.1453 1.9629 3.6050 2.5038 4.5918 2.5723 2.2839 1.7077 1.3557 1.2211 1.2698 2.5028 1.5071 1.4311 1.2831 1.6686 1.4644 1.3554 1.1938 1.5663 1.2826 1.2548 1.3726 1.0899 4.5501 4.2420 1.7569 2.9061 8.8811 1.0666 1.0895 1.0862 1.0858 1.0832 1.0823 1.0869 1.0893 1.0986 1.0657 1.0458 1.1044
irintensity: 0.8394 0.5381 6.0429 4.3301 2.3538 0.1712 2.1710 3.3402 0.7458 1.5040 5.4130 10.7845 3.7065 11.4876 2.4987 6.0663 2.8781 9.4355 1.3018 3.6936 37.8389 17.1059 28.4399 87.0355 119.2107 18.4844 13.7293 9.7197 49.4059 13.7009 48.8075 178.3406 10.0549 11.5362 0.1307 40.9669 101.4080 46.1539 28.6237 101.6478 54.9138 41.9594 17.8639 38.2826 97.5855 108.1332 3.0318 66.8662 30.3526 71.2089 33.6941 42.9817 11.9477 67.5958 37.2241 66.4726 87.7563 68.3382 21.4688 94.3068 55.9364 14.2847 4.7952 14.5276 67.0615 63.2780 13.0694 3.4999 38.0141 31.9663 42.4035 71.6506 9.2178 136.5525 59.8145 93.1156 463.0607 608.6759 52.5169 17.9775 15.3844 143.5517 67.1535 311.8475 2.2741 8.1297 4.6807 9.6903 144.9342 44.8622
temp: 298.150 k
press: 1.00000 atm
elementType: 16 15 8 8 8 8 8 8 7 7 7 6 6 6 6 6 6 6 6 6 1 1 1 1 1 1 1 1 1 1 1 1
symmnumber: 1
zpe: 593038.0 jmol-1
zpe.correction: 0.225876 hartree
zpe.thermalcorrener: 0.245011 hartree
zpe.thermalcorrenthalpy: 0.245955 hartree
zpe.thermalcorrgfe: 0.177641 hartree
zpe.sumelectzpe: -1703.509124 hartree
zpe.sumelectthermal: -1703.489989 hartree
zpe.sumelectthermalent: -1703.489045 hartree
zpe.sumelectthermalfe: -1703.557359 hartree
dipole: -9.1592 2.3378 -7.9343
dipole: 12.3413
quadrupole: -132.4870 -144.3025 -135.6399
quadrupole: 2.1972 15.4648 0.4914
quadrupole: 4.9894 -6.8260 1.8366 2.1972 15.4648 0.4914
hfenergy: -1703.7350003 hartree
pointgroup: C01 [X(C9H12N3O6P1S1)]
dipole: 3.5887704 1.8834899 2.6736822 debye
polarizability: 259.4911107|20.5973073|147.2079486|10.0172|9.3263147|140.4061736 unknown
InChI: InChI=1S/C9H12N3O6PS/c10-5-1-2-12(9(14)11-5)8-7(20)6(18-19(15)16)4(3-13)17-8/h1-2,4,6-8,13,15H,3,10H2
charge 0 multiplicity 1
32 atoms
S  -2.148547 -1.945888 1.400796
P  -3.814396 -0.88303 0.152505
O  -0.818886 0.422377 -1.099283
O  -3.38863 0.676767 0.878937
O  -3.266443 -0.807413 -1.465406
O  0.053037 3.124575 -1.521229
O  -5.325301 -1.297188 0.301077
O  1.534818 -1.694058 -1.837238
N  1.241755 -0.309542 0.052705
N  3.465666 -0.78137 -0.864957
N  5.354141 0.121553 0.127544
C  -1.945026 0.924721 0.975715
C  -1.07484 -0.397079 1.162873
C  -1.435633 1.561866 -0.341022
C  -0.199913 -0.52907 -0.114084
C  -0.443082 2.728733 -0.209738
C  1.818707 0.436787 1.064842
C  2.104558 -0.98906 -0.966078
C  3.182772 0.605304 1.149703
C  3.990556 -0.026962 0.12173
H  -1.843542 1.58982 1.848232
H  -0.488806 -0.339927 2.091395
H  -2.285528 1.89263 -0.960382
H  -0.290419 -1.507802 -0.6099
H  0.394087 2.487845 0.477359
H  -0.974533 3.610217 0.188682
H  1.159911 0.882905 1.815085
H  -2.320207 -0.452463 -1.596363
H  0.344997 2.305283 -2.001692
H  3.620432 1.189618 1.961074
H  5.885278 -0.342715 -0.60884
H  5.835617 0.680163 0.827254
