program: Gaussian 09
title: 000191724
version: EM64L-G09RevD.01
frameworkgroup: C1[X(C25H23NO8)]
method: RPBEPBE
basis: SDD
operation: Freq
keyword: #p
keyword: freq=noraman
keyword: PBEPBE/SDD
title: #p freq=noraman PBEPBE/SDD
converged: YES YES NO NO
title: Mulliken charges:
elementType: O O O O O O O O N C C C C C C C C C C C C C C C C C C C C C C C C C H H H H H H H H H H H H H H H H H H H H H H H
charge: -0.283650 -0.263608 -0.425012 -0.236861 -0.231203 -0.225771 -0.237334 -0.247243 -0.620377 -0.596962 -0.137826 0.537325 -0.484721 -0.446165 0.273527 0.191951 -0.332723 0.230839 -0.475194 0.450402 0.497055 -0.491759 0.311554 0.312540 -0.384295 -0.337948 -0.342186 -0.410693 -0.223061 -0.226132 -0.225130 -0.228263 -0.234112 -0.251880 0.259891 0.202181 0.246820 0.307374 0.236183 0.256059 0.277581 0.300515 0.225360 0.240816 0.250435 0.228589 0.381196 0.244691 0.257541 0.270985 0.232907 0.227485 0.227987 0.229099 0.228857 0.228959 0.233403
chargesum: 0.00000
title: Mulliken charges with hydrogens summed into heavy atoms:
elementType: O O O O O O O O N C C C C C C C C C C C C C C C C C C C C C C C C C
charge: -0.283650 -0.263608 -0.043816 -0.236861 -0.231203 -0.225771 -0.237334 -0.247243 -0.042280 -0.134890 0.108994 0.537325 -0.177347 -0.209982 0.273527 0.191951 -0.076664 0.230839 -0.009018 0.450402 0.497055 -0.012736 0.311554 0.312540 -0.139604 -0.080407 -0.071201 -0.177786 0.004424 0.001855 0.003969 0.000594 -0.005153 -0.018477
polarizability: 3.78030481e+02 1.23426862e+01 2.65965045e+02 7.39652992e+00 -1.72762831e+01 2.38646433e+02
1716.lowfreq: -5.0801 -0.0003 0.0003 0.0006 0.5496 4.3268 10.7653 15.7341 18.3293
frequency: 10.5392 15.4506 18.2653 22.1624 22.8754 25.9120 33.4987 34.9339 44.4060 46.4718 55.5152 59.7678 77.7666 83.1289 90.1498 99.9969 149.4953 157.9198 168.3213 182.7521 210.5374 219.7049 235.8474 243.4729 245.3066 257.3802 278.0914 304.4123 310.4737 319.6625 347.7115 354.2552 359.3970 380.3241 401.2371 401.9364 419.8580 451.3016 469.0715 478.9226 489.5219 506.1242 545.0675 562.5247 575.3890 578.3242 593.2172 606.4232 616.6709 617.4636 629.5959 637.1099 641.5139 661.3956 681.6544 686.1355 701.1658 702.8558 707.8362 724.8651 746.2085 750.5741 761.1728 783.2534 792.9999 814.7527 815.2494 822.4572 832.3396 844.7525 854.8413 857.6462 900.4622 917.9353 926.4161 929.0825 940.1040 953.3270 960.7329 973.3513 980.1503 981.3399 988.9469 990.5366 993.3989 994.1364 999.8740 1001.8207 1003.6258 1026.2260 1026.3623 1049.2841 1088.2708 1092.8609 1094.0443 1099.6107 1121.6038 1145.1333 1157.8809 1170.5867 1172.2562 1173.7362 1190.4905 1191.0963 1205.4792 1209.1454 1219.5059 1222.5131 1237.6237 1242.0071 1254.5726 1262.2239 1272.7569 1292.1588 1328.1947 1329.1204 1338.3295 1349.7475 1354.7617 1378.9677 1386.1128 1387.5959 1390.2399 1417.1786 1442.2508 1442.9213 1456.4779 1461.6376 1462.7318 1483.8050 1485.2674 1493.9058 1593.4895 1595.6348 1596.3695 1613.9114 1615.3084 1615.5336 1628.9422 1646.7357 1652.4977 1674.4563 2891.1076 3001.3054 3032.2219 3039.4990 3069.7251 3112.0121 3112.9218 3119.2036 3124.9307 3127.6939 3131.7536 3134.0678 3141.0780 3141.9363 3152.1407 3152.5138 3164.9046 3166.1006 3167.8601 3172.0996 3463.7289 3516.2124 3596.8679
redmass: 6.1809 5.5895 6.0269 5.1334 4.4711 5.1775 4.4429 6.2920 4.8311 6.4304 7.2018 7.8443 9.9484 8.3285 6.6032 6.4154 6.0874 5.8929 5.9209 6.8865 6.7124 5.0847 2.7963 5.7343 2.4881 2.9219 5.1584 4.9686 3.7070 3.1755 3.6542 2.2135 3.6435 4.3442 2.7922 2.8059 3.5162 3.9483 4.1446 4.0210 4.2478 4.1173 3.6765 4.6100 1.3012 5.5641 4.8279 5.0105 6.2996 6.0679 5.6572 1.4941 7.2185 5.4051 10.3140 10.9638 1.8400 1.9457 3.9789 4.5130 2.7871 2.3713 2.6996 3.6780 3.0926 3.5147 3.5222 2.4402 5.9424 2.8783 1.2605 1.2565 3.6440 1.6509 1.5087 1.4515 1.9995 1.4156 3.8341 2.2973 1.4236 1.4325 4.3223 5.1049 2.5259 2.4205 1.5645 1.5584 2.2047 2.2006 2.2032 2.4742 2.6978 1.6186 1.8354 3.4233 2.8608 1.8392 6.7611 1.1651 1.0546 1.0542 1.1272 1.1283 1.7602 1.4174 2.3918 2.7427 1.2719 1.1850 2.6169 1.8105 1.4888 1.3910 1.2659 1.2575 1.5029 1.2773 1.2883 3.7299 7.1825 7.6265 2.6687 3.0553 2.1457 2.1822 1.1020 1.1390 1.1258 2.3284 2.2955 3.1045 6.0948 6.1277 7.7644 7.0427 6.1693 6.0719 1.1008 10.8869 10.4557 9.0070 1.0811 1.0625 1.0598 1.0586 1.1000 1.1057 1.1078 1.0869 1.0848 1.0882 1.0880 1.0897 1.0918 1.0926 1.0967 1.0965 1.1013 1.1017 1.0931 1.0957 1.0446 1.0640 1.0987
irintensity: 0.0710 0.9372 0.5307 0.5388 0.8160 0.0957 0.0781 0.3321 0.6070 1.2106 1.9116 0.8118 1.0177 2.2274 0.5289 1.7023 1.1211 0.7839 3.3112 3.4226 5.3562 0.8988 14.2702 4.9235 34.9736 8.0563 0.9484 4.3239 4.9716 5.6559 14.7096 15.8799 1.8704 7.2754 0.1838 0.7611 2.6408 2.6505 5.0376 25.5437 11.2848 8.1945 23.0378 22.3637 32.0427 12.3281 26.2871 31.6941 0.2917 6.4704 14.4715 290.4596 7.5710 14.4876 30.7421 14.4023 48.8798 67.2913 12.0716 14.3866 90.3318 74.4361 31.5919 14.6608 3.0550 8.2712 3.5424 39.1974 65.6165 52.2986 0.8647 2.8907 21.4814 35.3761 4.4207 1.1213 3.0491 6.3431 21.7896 2.4054 0.1670 0.7868 4.2230 0.1277 11.9290 14.3625 9.9757 15.3231 19.4287 2.4027 5.4719 285.1732 222.0710 2.6363 17.0484 257.4399 139.9226 54.5427 1770.6826 27.6875 1.8224 0.2647 11.5899 2.6673 9.1447 0.4330 18.1178 21.1585 25.5048 21.4842 43.9670 24.8562 15.5440 15.5355 4.0924 2.5866 7.2557 13.9781 21.5467 3.0461 1.0899 1.8607 12.8747 31.6078 8.5534 8.2072 17.8089 24.0945 26.0271 10.5719 4.3314 132.0816 1.1439 0.9586 4.9937 22.7448 2.6299 2.2120 46.8585 141.3419 241.9628 164.4568 60.4876 33.6506 31.6767 31.4125 7.2940 5.0009 7.0136 5.4223 0.2941 4.9476 2.3179 16.0278 14.8937 19.4856 9.8210 35.7159 15.4982 19.9039 5.7696 6.9025 2.9583 24.7889 4.2603
temp: 298.150 k
press: 1.00000 atm
elementType: 8 8 8 8 8 8 8 8 7 6 6 6 6 6 6 6 6 6 6 6 6 6 6 6 6 6 6 6 6 6 6 6 6 6 1 1 1 1 1 1 1 1 1 1 1 1 1 1 1 1 1 1 1 1 1 1 1
symmnumber: 1
zpe: 1137864.1 jmol-1
zpe.correction: 0.433390 hartree
zpe.thermalcorrener: 0.465295 hartree
zpe.thermalcorrenthalpy: 0.466239 hartree
zpe.thermalcorrgfe: 0.362591 hartree
zpe.sumelectzpe: -1620.546122 hartree
zpe.sumelectthermal: -1620.514216 hartree
zpe.sumelectthermalent: -1620.513272 hartree
zpe.sumelectthermalfe: -1620.616920 hartree
dipole: 0.0123 1.8199 1.8776
dipole: 2.6149
quadrupole: -152.8411 -181.6681 -194.5046
quadrupole: 2.2909 -11.0430 -9.2439
quadrupole: 23.4969 -5.3302 -18.1667 2.2909 -11.0430 -9.2439
hfenergy: -1620.9795111 hartree
pointgroup: C01 [X(C25H23N1O8)]
dipole: 0.0502752 -0.442882 -0.92722 debye
polarizability: 373.2687679|-24.3792079|279.0282331|6.131779|-7.0211879|230.3449576 unknown
InChI: InChI=1S/C25H23NO8/c26-20(23(27)28)13-19-11-12-21(33-24(29)31-15-17-7-3-1-4-8-17)22(14-19)34-25(30)32-16-18-9-5-2-6-10-18/h1-12,14,20,27H,13,15-16,26H2
charge 0 multiplicity 1
57 atoms
O  -0.379327 0.408604 0.81215
O  0.564429 2.590012 -0.645656
O  -6.083677 -1.358472 -1.40708
O  -5.095285 -0.914502 0.64289
O  0.574362 -1.569861 1.08776
O  2.700893 2.585188 -0.032881
O  -1.292966 -1.452317 -0.337388
O  1.077439 2.930609 1.635975
N  -7.22294 1.188996 -0.957369
C  -5.127973 1.955161 0.140973
C  -5.762405 0.963919 -0.873018
C  -3.6236 2.12684 -0.026455
C  -2.719042 1.159495 0.480587
C  -3.102336 3.25792 -0.706306
C  -1.337699 1.323789 0.289259
C  -0.828601 2.461134 -0.376646
C  -1.71177 3.430841 -0.878544
C  -5.580847 -0.492706 -0.425626
C  0.786566 -3.016252 0.700711
C  1.535684 -3.142022 -0.606327
C  4.259853 1.322537 1.452466
C  3.79806 2.689886 1.00072
C  -0.457358 -0.940441 0.430733
C  1.422541 2.710584 0.460027
C  0.880917 -3.631876 -1.763474
C  2.904643 -2.775564 -0.683268
C  3.454681 0.53996 2.321104
C  5.511959 0.815603 1.023426
C  1.587036 -3.767177 -2.98001
C  3.607072 -2.901124 -1.900589
C  3.901835 -0.726727 2.754104
C  5.9633 -0.449687 1.462699
C  2.951373 -3.402902 -3.050258
C  5.158754 -1.222816 2.331977
H  -5.381245 1.611827 1.159288
H  -5.619998 2.935323 -0.006962
H  -5.236597 1.068769 -1.852607
H  -3.098685 0.279856 1.008078
H  -3.788917 4.018079 -1.096349
H  -1.301087 4.302451 -1.39635
H  -7.479162 2.166555 -1.123062
H  -7.706734 0.53542 -1.580776
H  1.369784 -3.388313 1.557509
H  -0.199215 -3.510218 0.65913
H  3.405892 3.291123 1.839758
H  4.591982 3.236136 0.468639
H  -5.980336 -2.300714 -1.102656
H  -0.183074 -3.888823 -1.712164
H  3.409972 -2.372182 0.202228
H  2.479271 0.918827 2.645478
H  6.135255 1.412679 0.346253
H  1.07353 -4.14615 -3.870515
H  4.661095 -2.606789 -1.953805
H  3.271761 -1.321358 3.424762
H  6.937265 -0.828546 1.13317
H  3.498535 -3.502599 -3.994584
H  5.510334 -2.200888 2.680268
