program: Gaussian 09
title: 000192377
version: EM64L-G09RevD.01
frameworkgroup: C1[X(C28H25NO6)]
method: RPBEPBE
basis: SDD
operation: Freq
keyword: #p
keyword: freq=noraman
keyword: PBEPBE/SDD
title: #p freq=noraman PBEPBE/SDD
converged: YES YES NO NO
title: Mulliken charges:
elementType: O O O O O O N C C C C C C C C C C C C C C C C C C C C C C C C C C C C H H H H H H H H H H H H H H H H H H H H H H H H H
charge: -0.263819 -0.263893 -0.216252 -0.262058 -0.432469 -0.206859 -0.068495 -0.307325 -0.620664 0.175033 0.534401 0.158998 -0.048275 0.216474 -0.477460 -0.484327 0.281964 0.313279 0.392527 -0.190898 -0.397528 -0.397426 -0.381691 -0.395460 -0.448636 -0.261956 -0.236254 -0.234390 -0.230223 -0.251723 -0.241061 -0.244340 -0.660228 -0.407059 0.215132 0.304262 0.242742 0.246547 0.239140 0.235826 0.226681 0.254556 0.273262 0.263493 0.261571 0.312623 0.224689 0.234676 0.233048 0.231186 0.229941 0.239011 0.232247 0.233407 0.230136 0.252785 0.217754 0.242100 0.276643 0.404636
chargesum: 0.00000
title: Mulliken charges with hydrogens summed into heavy atoms:
elementType: O O O O O O N C C C C C C C C C C C C C C C C C C C C C C C C C C C C
charge: -0.263819 -0.263893 -0.216252 -0.262058 -0.027834 -0.206859 -0.068495 -0.003064 -0.131375 0.175033 0.534401 0.158998 -0.048275 0.216474 -0.238320 -0.248501 0.281964 0.313279 0.392527 0.035782 -0.142972 -0.124164 -0.118198 -0.133889 -0.136013 0.197408 -0.003206 -0.003204 -0.000282 -0.012712 -0.008815 -0.010933 0.040446 0.111685 0.215132
polarizability: 4.02919501e+02 -1.27076932e+01 2.91506366e+02 6.51532859e+00 -3.54395033e+01 3.15694317e+02
1716.lowfreq: -8.3487 -2.5542 -0.0003 0.0005 0.0006 2.2358 15.0907 18.6105 21.8881
frequency: 15.0622 18.4962 21.8466 34.4088 37.0451 43.3872 45.4155 51.2724 56.9677 63.6364 70.2063 71.7841 76.1530 85.6162 95.6660 115.5960 121.0305 135.1703 170.6062 191.8953 193.6439 214.9073 229.7557 245.0708 256.8007 262.5548 280.7666 288.2921 292.7831 319.6023 328.4754 357.3382 374.2639 393.6964 401.9556 405.3459 426.1572 439.4149 475.5632 489.2727 499.0076 503.6262 516.8682 527.9539 539.9303 576.5228 605.8210 612.8011 615.3353 623.4832 642.7642 654.8627 665.1065 670.1895 682.6112 699.1450 699.9713 701.3133 706.8407 712.1738 736.3756 741.3725 772.7576 780.4654 794.1924 809.9966 828.4006 832.9283 856.2865 867.4667 871.5910 891.7106 894.2686 901.6007 922.5592 932.4157 936.2764 938.9490 946.5623 974.8486 983.0970 985.0608 987.4718 988.8762 989.9048 1000.2460 1001.5394 1002.7798 1006.3080 1009.5922 1015.3107 1028.1710 1029.8090 1035.3805 1070.7319 1077.7924 1082.3272 1084.7198 1094.9387 1111.3307 1123.6470 1155.9798 1157.0067 1168.1043 1173.3635 1174.0101 1174.9029 1192.6283 1193.7273 1196.5285 1226.5659 1235.2419 1249.2083 1267.6214 1278.6725 1279.9837 1304.4432 1305.9882 1321.6931 1326.0651 1330.2580 1355.3252 1356.3034 1360.8647 1375.8679 1377.2034 1389.7244 1392.6658 1434.0197 1436.2764 1437.4875 1452.7186 1457.5306 1463.0172 1468.1441 1475.3449 1480.7280 1484.5740 1495.6677 1551.6632 1574.3468 1581.4243 1587.3806 1603.3800 1606.3166 1614.5531 1616.7654 1638.3713 1681.3716 2994.6135 2995.7960 3011.0935 3029.8383 3053.4463 3080.2035 3083.8694 3089.8463 3094.6932 3120.5845 3128.5880 3128.6894 3129.3541 3138.3159 3138.8564 3146.9397 3150.3545 3151.2088 3152.3256 3159.0951 3160.1302 3169.6062 3170.1513 3173.9442 3386.8412
redmass: 5.3214 6.0109 4.5828 5.2596 4.9105 4.2761 4.3977 8.1527 6.6263 6.7469 5.6231 4.5287 4.0618 4.8482 5.9326 4.3249 5.2075 7.0574 5.1549 3.5289 2.0182 3.1248 3.0019 5.1769 3.5699 3.6623 7.6883 4.5280 5.2403 3.7488 4.5771 5.6254 4.5570 5.1600 2.8536 2.8981 3.3487 3.3692 3.7286 2.2580 3.7700 4.1965 4.9064 4.9721 4.9097 5.1695 5.4835 6.4397 6.1595 5.9725 5.6629 1.3195 6.4817 5.0785 6.2310 2.1915 2.3649 3.5031 2.1288 3.6108 4.4639 4.9383 1.8092 1.9801 1.5195 1.3612 3.2077 4.7273 1.2475 1.2545 1.5648 1.8857 3.8285 3.5930 2.5525 1.5124 2.5711 1.7227 4.3893 1.3468 1.6208 5.5522 5.6931 4.0205 1.3995 1.3796 3.0698 1.6013 2.6673 3.4705 3.5326 2.5783 2.6871 2.1946 2.5980 1.8446 1.6934 1.6304 2.2692 3.3295 3.7304 1.7016 1.6665 1.9102 1.1191 1.0640 1.0562 1.5311 1.5070 1.1783 1.2378 2.1929 2.4747 1.5908 1.1170 1.6180 1.4811 1.2937 1.4322 1.3725 1.4821 1.2916 1.5791 3.1890 6.1378 6.9516 7.0877 1.2306 2.3048 2.3344 2.3055 1.1579 1.0929 1.0441 2.1777 1.1773 2.2253 1.0516 2.7315 9.4163 6.5063 5.9888 7.4241 6.4082 6.5057 5.9852 6.4459 9.5393 8.8082 1.0361 1.0650 1.0614 1.0595 1.0832 1.1017 1.0959 1.0974 1.1035 1.1060 1.0851 1.0871 1.0851 1.0885 1.0886 1.0911 1.0928 1.0929 1.0928 1.0961 1.0961 1.1013 1.1013 1.0974 1.0648
irintensity: 0.5532 0.1520 0.5191 0.8478 0.5907 0.3795 0.4528 0.3183 0.5076 3.0560 0.1254 0.3105 0.7442 0.1119 2.2854 1.4827 0.9680 0.8778 0.7359 2.9180 1.9089 1.1589 3.0954 0.5334 2.1873 0.6764 1.1230 4.3468 1.0748 7.5557 5.9881 10.1163 0.6298 2.5205 0.0982 0.1462 1.5021 1.6322 11.6579 23.6408 1.4125 14.8383 3.6718 0.8312 7.4099 25.1202 4.3907 0.5299 3.8565 15.7702 22.8085 173.7803 14.0670 0.7928 4.8508 8.2978 52.0348 23.5083 54.7189 3.2420 14.2335 5.2126 89.6529 21.9101 52.7043 2.4870 6.5254 4.5697 0.6389 2.1599 16.0701 7.1565 2.8492 7.0898 3.3750 14.4048 24.2510 21.2239 20.8664 0.9949 2.9445 4.1434 0.3037 1.3304 1.8516 1.4770 9.2091 14.6004 19.5452 60.7767 35.8039 108.2045 116.3636 4.8946 88.2687 25.1900 3.9891 5.6155 93.9125 288.0747 63.5879 21.8946 3.8611 93.7269 6.8610 0.1872 0.0176 3.2962 6.4636 1.1441 0.8069 67.5548 75.2008 41.1333 3.1884 5.7993 17.8813 2.9982 3.5304 1.2249 8.0876 1.8548 23.0475 13.8133 0.4519 1.3050 8.1531 23.7375 12.8830 20.0638 9.8994 39.6027 13.0647 13.5647 16.3179 32.7698 19.3001 12.9683 17.5196 23.3895 2.6784 2.8809 2.1317 60.1441 34.3697 9.8161 9.3885 143.1871 136.9749 19.2625 23.5212 12.7493 32.2333 0.6399 13.3429 5.8078 34.7616 0.5342 30.0322 0.5880 7.0522 0.6977 7.6074 6.9275 29.3119 4.8668 28.0150 14.6250 14.0508 7.4950 22.4215 20.4235 10.5096 230.2326
temp: 298.150 k
press: 1.00000 atm
elementType: 8 8 8 8 8 8 7 6 6 6 6 6 6 6 6 6 6 6 6 6 6 6 6 6 6 6 6 6 6 6 6 6 6 6 6 1 1 1 1 1 1 1 1 1 1 1 1 1 1 1 1 1 1 1 1 1 1 1 1 1
symmnumber: 1
zpe: 1220745.6 jmol-1
zpe.correction: 0.464957 hartree
zpe.thermalcorrener: 0.496774 hartree
zpe.thermalcorrenthalpy: 0.497718 hartree
zpe.thermalcorrgfe: 0.397363 hartree
zpe.sumelectzpe: -1585.589686 hartree
zpe.sumelectthermal: -1585.557869 hartree
zpe.sumelectthermalent: -1585.556925 hartree
zpe.sumelectthermalfe: -1585.657280 hartree
dipole: 0.3585 -2.0032 1.5475
dipole: 2.5566
quadrupole: -159.4385 -207.2359 -196.6020
quadrupole: 6.6381 1.8128 -0.9425
quadrupole: 28.3203 -19.4771 -8.8432 6.6381 1.8128 -0.9425
hfenergy: -1586.0546433 hartree
pointgroup: C01 [X(C28H25N1O6)]
dipole: 0.0011045 0.8478712 0.5411529 debye
polarizability: 393.4441927|-34.1018158|306.7308527|5.7386766|35.7973742|309.9451385 unknown
InChI: InChI=1S/C28H25NO6/c1-2-33-28(32)23(17-19-10-9-15-22(16-19)34-18-24(30)31)27-29-25(20-11-5-3-6-12-20)26(35-27)21-13-7-4-8-14-21/h3-16,23,30H,2,17-18H2,1H3
charge 0 multiplicity 1
60 atoms
O  0.715787 1.051427 0.898219
O  5.000403 0.88146 -0.415814
O  3.3808 2.49183 0.07092
O  -0.834359 -4.086828 1.060946
O  -2.978825 -1.515714 -0.470577
O  -1.331861 -2.83625 -1.462161
N  0.523287 0.513187 -1.307009
C  2.756687 0.085704 -0.154489
C  3.029437 -0.805654 1.115258
C  1.332318 0.527933 -0.261869
C  2.447991 -2.210579 1.013657
C  -0.610048 1.379799 0.49786
C  -0.713506 1.062731 -0.861039
C  3.698056 1.303316 -0.150066
C  1.046089 -2.431863 1.079959
C  3.31565 -3.318553 0.858459
C  -1.490099 1.877667 1.559911
C  -1.827619 1.223089 -1.812485
C  0.53604 -3.745681 0.981488
C  2.7923 -4.630773 0.774561
C  1.404537 -4.852558 0.835784
C  -2.865627 1.51467 1.60218
C  -0.95802 2.701889 2.59086
C  -2.79952 2.251716 -1.679083
C  -1.924142 0.324355 -2.914332
C  6.054107 1.947009 -0.459981
C  -3.692565 1.991189 2.640532
C  -1.790255 3.170284 3.628397
C  -3.850614 2.367835 -2.613217
C  -2.981526 0.44276 -3.84405
C  -3.161651 2.823078 3.654933
C  -3.95202 1.462066 -3.696103
C  6.127877 2.572016 -1.854998
C  -1.82964 -3.038117 0.969226
C  -1.974335 -2.489312 -0.454867
H  2.987968 -0.50855 -1.055648
H  4.123982 -0.875697 1.233189
H  2.627251 -0.273744 1.997204
H  0.377687 -1.575292 1.214027
H  4.398018 -3.154498 0.805404
H  3.469714 -5.483664 0.657523
H  0.974615 -5.855792 0.764276
H  -3.27384 0.8404 0.842121
H  0.102698 2.972026 2.564558
H  -2.724337 2.969065 -0.85547
H  -1.155863 -0.446962 -3.03389
H  6.97705 1.406719 -0.195708
H  5.818451 2.703371 0.309215
H  -4.748813 1.701354 2.665548
H  -1.370577 3.808026 4.414041
H  -4.587171 3.171128 -2.500536
H  -3.041192 -0.256395 -4.685352
H  -3.807169 3.189825 4.460574
H  -4.769759 1.555595 -4.418946
H  6.306435 1.80105 -2.624029
H  5.194274 3.107672 -2.0947
H  6.961179 3.298037 -1.892835
H  -1.643932 -2.198321 1.667315
H  -2.782749 -3.509708 1.261413
H  -3.027653 -1.087276 -1.3751
