program: Gaussian 09
title: 000191612
version: EM64L-G09RevD.01
frameworkgroup: C1[X(C6H13NO3S)]
method: RPBEPBE
basis: SDD
operation: Freq
keyword: #p
keyword: freq=noraman
keyword: PBEPBE/SDD
title: #p freq=noraman PBEPBE/SDD
converged: YES YES NO NO
title: Mulliken charges:
elementType: S O O O N C C C C C C H H H H H H H H H H H H H
charge: 0.120300 -0.430046 -0.230552 -0.441979 -0.609829 -0.389071 -0.101898 -0.693226 -0.673306 0.175152 -0.272681 0.228715 0.220670 0.255601 0.293982 0.263744 0.310774 0.249404 0.273907 0.301129 0.201657 0.220790 0.383957 0.342805
chargesum: 0.00000
title: Mulliken charges with hydrogens summed into heavy atoms:
elementType: S O O O N C C C C C C
charge: 0.120300 -0.046089 -0.230552 -0.099174 -0.034794 0.060314 0.153704 -0.135499 -0.113128 0.175152 0.149767
polarizability: 1.17272037e+02 -5.94232835e+00 9.65382411e+01 1.03241359e+01 -2.16022850e+00 8.34053512e+01
1716.lowfreq: -10.6071 -0.7480 -0.0028 -0.0018 -0.0013 8.6345 29.4478 36.6957 49.2520
frequency: 25.9300 35.8433 49.0270 80.1405 93.2558 120.4413 156.9348 220.7998 240.4159 271.2399 283.8233 297.3383 321.8721 397.4364 448.2778 475.0161 490.3759 513.9903 587.1495 599.7140 610.8394 620.8310 703.2977 739.3806 814.0686 843.1752 911.6080 945.5001 978.9582 1026.1881 1034.1140 1050.0512 1057.0751 1112.5241 1144.2511 1156.8290 1164.6696 1188.0360 1210.4268 1251.9275 1279.7532 1298.3807 1313.1646 1322.5129 1330.6371 1371.7830 1400.8076 1433.0520 1444.4099 1450.8273 1463.3029 1609.3740 1674.3369 2965.1958 2972.6288 3017.8101 3028.9879 3030.3081 3041.7604 3062.6425 3106.5778 3114.0465 3476.3139 3486.7539 3500.5580 3627.2343
redmass: 6.1817 6.5394 7.5997 4.1007 3.9165 3.9469 4.1443 1.4283 2.7109 2.4816 2.4882 2.9148 2.2617 3.0933 2.0139 1.4850 1.7830 2.2380 2.6788 2.3960 1.9314 4.4003 3.2838 2.3964 1.8940 2.0956 2.1558 1.9434 2.1599 2.3688 2.1639 2.8526 3.2869 1.5062 1.2519 1.2052 1.4601 1.3331 1.3440 1.5195 1.3156 1.2685 1.1383 1.3466 1.1932 1.2092 1.6573 1.0930 1.1026 1.0879 1.0849 1.2665 4.1013 1.0664 1.0611 1.0844 1.0641 1.0619 1.0944 1.0964 1.1056 1.1059 1.0649 1.0447 1.0638 1.0997
irintensity: 3.0440 1.2298 3.6302 5.4952 0.6845 5.8628 3.3973 38.4793 11.9354 5.1726 5.6118 2.6319 7.9459 15.9142 41.4525 196.2398 158.5951 117.0099 18.1069 53.9038 66.9103 18.9396 66.1168 10.2665 1.5190 11.3786 32.9438 13.5203 5.0915 26.4604 34.3434 240.1599 9.0967 4.3787 2.4297 15.7675 8.7825 6.5371 4.1490 4.7041 25.5232 7.2588 3.0548 8.4111 12.9855 17.4945 6.2484 21.1898 16.9459 2.8733 4.1985 156.1533 169.8621 73.8319 21.1756 19.1613 4.4780 20.7208 29.4157 28.3527 6.5694 3.9336 6.6986 8.8350 24.5644 11.3119
temp: 298.150 k
press: 1.00000 atm
elementType: 16 8 8 8 7 6 6 6 6 6 6 1 1 1 1 1 1 1 1 1 1 1 1 1
symmnumber: 1
zpe: 508986.7 jmol-1
zpe.correction: 0.193863 hartree
zpe.thermalcorrener: 0.207616 hartree
zpe.thermalcorrenthalpy: 0.208560 hartree
zpe.thermalcorrgfe: 0.151686 hartree
zpe.sumelectzpe: -914.003101 hartree
zpe.sumelectthermal: -913.989348 hartree
zpe.sumelectthermalent: -913.988404 hartree
zpe.sumelectthermalfe: -914.045278 hartree
dipole: 0.0835 -0.9101 -0.0296
dipole: 0.9144
quadrupole: -87.3739 -69.8667 -73.9267
quadrupole: -3.8212 7.1586 -4.6616
quadrupole: -10.3182 7.1891 3.1291 -3.8212 7.1586 -4.6616
hfenergy: -914.1969639 hartree
pointgroup: C01 [X(C6H13N1O3S1)]
dipole: -0.036628 -0.3017053 0.1924913 debye
dipolederiv: -0.4532726 -0.1036052 0.0618296 -0.1575235 -0.1852184 -0.0696929 0.0432464 -0.0973506 -0.1534845 -0.8887361 -0.3272021 0.103436 -0.4060319 -0.6391509 0.0344679 0.2131441 0.0615044 -0.3082345 -0.966272 -0.0328705 -0.1121647 0.0958711 -0.4795993 0.1632441 -0.3612442 0.1547971 -0.5054509 -0.7367949 0.0296686 0.0765584 0.0141695 -0.2794568 -0.1865432 0.1155987 -0.1544838 -0.6282276 -0.6493445 0.0848979 0.2088301 0.1021558 -0.546814 -0.2188863 0.3703794 -0.2045161 -0.5460917 -0.0356361 -0.0514405 0.1081501 0.0134901 0.0585409 -0.0672015 -0.0652155 0.0579589 -0.0398659 0.4173669 0.1031836 -0.2851981 0.1254383 0.0664763 0.1456271 -0.2637874 0.1753459 0.242158 0.344246 0.0889667 0.1273722 0.139733 0.022994 0.0840243 0.239562 0.0984294 0.1078473 0.0389425 0.1668229 0.0060934 0.2290942 0.2515651 0.0465116 -0.0257873 0.0268127 0.0126373 1.4725779 0.2867661 0.1632044 0.2092324 0.8266157 -0.3856755 0.3378218 -0.4632706 0.5532742 0.4149107 0.0004417 0.0049489 -0.0935732 0.2136507 0.1440812 0.0204373 0.0767005 0.4894357 0.0557797 0.0315392 0.0129386 0.0220168 -0.0613883 0.1002455 0.0716175 0.1000859 -0.0058508 -0.0969408 -0.0724778 -0.1158977 -0.0021397 0.0684996 -0.0414835 -0.0687 -0.0802917 -0.0364001 -0.0093302 -0.0839317 -0.0411694 -0.0731336 0.0213277 -0.0318747 -0.0631519 -0.0373408 0.0017243 0.0312163 -0.0354094 -0.0291074 -0.0566433 0.0151389 0.076916 -0.0473336 0.0491956 -0.0117437 -0.0529181 0.0430416 0.0067432 0.0491253 -0.0391936 -0.1054324 -0.0180307 -0.1056267 -0.0063176 0.0434437 -0.0091307 -0.0007817 -0.0149703 -0.0162462 0.0227194 -0.0287884 0.0495222 0.0548961 0.050215 -0.0364907 0.0161345 -0.0551311 0.002723 -0.0782343 0.0194091 -0.0847814 -0.0954713 0.1803684 0.0182515 -0.0298371 -0.0496302 0.1355447 0.2084257 -0.0814919 0.1063713 0.2729577 0.1845432 -0.0508642 -0.0245072 -0.1124919 0.296671 0.0204155 -0.1321564 0.0078829 0.1690848 -0.1006019 0.0357831 -0.0916285 0.1122979 0.0454933 0.0449224 -0.1305251 -0.0009766 -0.110314 0.0376318 -0.0764991 0.0083152 -0.0703419 -0.1299355 -0.0138147 0.065218 0.0644617 0.0583446 0.2412898 0.0595473 -0.0968257 0.0125858 0.3020052 0.0853026 -0.0945297 0.1256463 0.2229434 0.4773153 -0.0689882 -0.077437 -0.0335997 0.0497568 0.0219358 -0.115692 0.0739237 0.2621494 unknown
polarizability: 117.5062077|10.1109009|94.7761148|5.8246666|-4.7825212|84.9333066 unknown
InChI: InChI=1S/C6H13NO3S/c7-5(6(9)10)1-3-11-4-2-8/h5,8-9H,1-4,7H2
charge 0 multiplicity 1
24 atoms
S  1.727374 -1.20398 0.791296
O  -0.757154 1.568119 -0.865084
O  -2.962586 0.930719 -1.198471
O  3.605028 0.194121 -1.348204
N  -2.865813 -0.561198 1.150472
C  -0.945362 -1.542735 -0.210236
C  -1.598234 -0.282715 0.468733
C  0.513102 -1.384026 -0.673453
C  2.208971 0.638539 0.66886
C  -1.881538 0.776261 -0.590569
C  3.575794 0.803443 -0.015523
H  -0.998284 -2.359996 0.534843
H  -1.575212 -1.851494 -1.070411
H  -0.863662 0.124354 1.187745
H  0.662279 -0.507306 -1.323704
H  0.84126 -2.285974 -1.217403
H  1.407065 1.141538 0.105505
H  2.225197 1.025452 1.702602
H  -2.833557 -1.313766 1.839807
H  -3.685908 -0.571932 0.538391
H  4.378216 0.385069 0.628136
H  3.78367 1.874944 -0.184445
H  -0.979274 2.218513 -1.586781
H  3.40153 -0.772353 -1.22031
