program: Gaussian 09
title: 000191650
version: EM64L-G09RevD.01
frameworkgroup: C1[X(C19H23N4O2S)]
method: RPBEPBE
basis: SDD
operation: Freq
keyword: #p
keyword: freq=noraman
keyword: PBEPBE/SDD
title: #p freq=noraman PBEPBE/SDD
converged: YES YES NO NO
title: Mulliken charges:
elementType: S O O N N N N C C C C C C C C C C C C C C C C C C C H H H H H H H H H H H H H H H H H H H H H H H
charge: 0.504259 -0.439087 -0.437323 -0.161145 -0.063853 -0.007232 -0.638600 -0.077403 0.564120 -0.296371 -0.574817 -0.278878 -0.513184 -0.758949 0.321846 0.449567 -0.331076 0.087121 -0.431459 -0.375379 -0.385266 -0.214547 -0.200421 -0.219156 -0.005733 -0.730181 0.243021 0.267693 0.253594 0.255712 0.225775 0.251784 0.285583 0.250090 0.236326 0.241788 0.239515 0.261265 0.386334 0.265778 0.250708 0.251904 0.255989 0.356539 0.318129 0.368266 0.245865 0.251062 0.250424
chargesum: 1.00000
title: Mulliken charges with hydrogens summed into heavy atoms:
elementType: S O O N N N N C C C C C C C C C C C C C C C C C C C
charge: 0.504259 -0.052753 -0.069057 -0.161145 -0.063853 -0.007232 0.036068 -0.077403 0.564120 -0.296371 -0.064102 -0.025284 -0.031698 0.028507 0.321846 0.449567 0.147039 0.087121 -0.191944 -0.114113 -0.119488 0.036161 0.051484 0.036833 -0.005733 0.017170
polarizability: 2.88550409e+02 -1.11299404e+01 2.50269354e+02 2.05615529e-01 7.14529063e+00 2.25332735e+02
1716.lowfreq: -5.6511 -3.6965 -0.0013 -0.0012 -0.0004 5.7725 12.1091 22.5937 24.9869
frequency: 11.5077 22.5551 24.8530 27.3145 33.3762 47.8349 55.3974 59.7842 90.0226 109.5329 111.6752 123.9699 143.8304 153.1564 171.5855 203.8312 207.2363 222.9488 229.7057 251.6779 265.7255 282.3687 287.1247 298.8363 308.6957 316.1734 325.5654 357.7340 380.0205 399.7567 402.3139 425.2438 433.9789 466.3743 480.4943 504.1014 518.2889 530.1104 560.1337 578.1685 586.5797 599.1986 613.0538 617.5536 640.7302 649.7956 693.3035 701.6578 716.1061 737.2236 759.9837 779.3329 791.8685 799.8432 820.9426 856.1605 872.9646 894.8483 907.3681 928.9903 933.6134 957.2654 974.8305 978.9304 986.2215 988.6733 988.9696 1013.0147 1017.9534 1025.3709 1032.7097 1038.4710 1043.3769 1050.8402 1079.6586 1086.4430 1136.1010 1141.5279 1175.2072 1181.3368 1184.2812 1186.5905 1193.2623 1236.7347 1241.9153 1246.2697 1258.8954 1270.8121 1278.4297 1292.7037 1321.3887 1323.4867 1331.1380 1335.4579 1342.6827 1365.6423 1379.0407 1388.4988 1388.7765 1407.8042 1413.8768 1426.1677 1442.2055 1444.4660 1452.9399 1458.6960 1461.5396 1463.1004 1470.9837 1477.5781 1479.9545 1486.0791 1545.7076 1554.6883 1592.6024 1602.9502 1604.0048 1629.7852 2942.6317 2986.6741 3001.1096 3002.3006 3014.7014 3024.6354 3060.6963 3082.9310 3084.1033 3084.9372 3099.1050 3112.6198 3117.0335 3117.7019 3130.9873 3138.1439 3150.6956 3162.0817 3178.4106 3528.8015 3583.6528 3583.7674 3682.2651
redmass: 1.1292 4.6094 4.7367 4.1761 4.9997 3.8606 4.4730 4.2288 3.4441 5.9197 3.6216 3.6888 1.5246 2.5913 5.0441 4.6870 4.5312 4.0428 4.1064 3.6079 3.2233 1.5302 1.3409 2.8294 1.7458 3.2842 2.5740 4.2993 3.1903 1.4727 2.3953 4.6871 2.7349 2.9706 3.8914 5.2503 5.0502 4.0476 6.5997 3.9605 4.6179 2.9334 2.6519 3.2441 4.4113 2.7713 5.6272 2.6017 2.5570 4.9805 5.3304 1.9780 5.3849 3.9931 2.9805 1.2473 2.9223 2.7475 3.2116 1.7207 1.4365 2.0261 2.4744 1.8418 1.3905 2.9851 6.0511 1.3546 3.3602 2.2963 1.8366 1.7976 1.8439 1.6467 2.1416 1.6291 2.4572 1.2402 3.2894 1.5124 1.4075 1.5250 1.4076 1.3132 2.2320 1.3591 3.8262 3.4263 1.4372 2.2783 1.7294 1.2829 1.4877 1.3457 1.5919 1.5232 1.2513 7.5371 1.3844 2.1214 1.2785 3.0396 1.0913 2.1203 1.0859 1.4470 1.0931 1.2543 1.0843 1.9047 2.1785 1.2253 4.9903 5.1919 5.9620 6.1931 6.8560 1.2930 1.0827 1.0641 1.0392 1.0388 1.0627 1.0613 1.0960 1.0985 1.0946 1.1006 1.1053 1.0902 1.0972 1.0920 1.0893 1.1007 1.0895 1.0952 1.1012 1.0473 1.0671 1.0669 1.1016
irintensity: 0.7143 0.8922 0.7772 0.0579 0.2895 1.5910 0.9474 1.4239 0.9686 1.7481 4.0350 5.9776 3.1337 3.5147 2.9801 11.5411 9.3175 9.7268 4.1036 5.4911 26.4372 140.3305 86.3806 17.6588 24.4836 3.3472 43.8195 0.4495 0.5093 60.3703 14.4034 2.3897 32.2220 2.9850 2.4638 2.5143 8.4159 13.6640 4.9649 16.5140 11.9816 25.9734 54.2871 42.1065 4.9744 37.9745 7.6138 17.5250 80.7408 5.3530 5.5537 29.0770 15.5521 4.7724 0.9396 1.0039 19.3743 1.6263 4.4089 6.0374 6.7895 14.0173 96.5743 43.3612 0.6205 8.9473 6.2995 0.1998 11.2978 6.6608 5.5186 12.2665 7.8000 12.0414 7.2413 9.4572 20.9528 55.9009 3.1934 6.0195 29.1873 45.8869 11.1072 1.5330 26.2866 6.0906 40.1791 3.7035 1.5209 2.2478 5.9215 14.7271 5.4421 8.3589 14.2332 3.8283 6.7173 0.4713 13.2013 18.2725 30.3151 202.1101 10.7932 13.7656 27.0612 17.7413 16.8235 12.9324 5.4674 33.6906 21.5373 53.9949 178.9054 135.3081 1.6475 11.1161 27.8704 298.1979 24.2556 8.2542 0.8377 4.0774 43.2083 16.4531 10.0199 4.6452 6.7146 1.3883 18.4598 6.3432 7.2404 8.8515 1.8978 7.9373 0.7075 9.4412 8.1699 110.2678 22.8450 50.1008 32.3234
temp: 298.150 k
press: 1.00000 atm
elementType: 16 8 8 7 7 7 7 6 6 6 6 6 6 6 6 6 6 6 6 6 6 6 6 6 6 6 1 1 1 1 1 1 1 1 1 1 1 1 1 1 1 1 1 1 1 1 1 1 1
symmnumber: 1
zpe: 1029220.0 jmol-1
zpe.correction: 0.392009 hartree
zpe.thermalcorrener: 0.418478 hartree
zpe.thermalcorrenthalpy: 0.419422 hartree
zpe.thermalcorrgfe: 0.331969 hartree
zpe.sumelectzpe: -1503.194918 hartree
zpe.sumelectthermal: -1503.168449 hartree
zpe.sumelectthermalent: -1503.167505 hartree
zpe.sumelectthermalfe: -1503.254958 hartree
dipole: 2.9846 -2.6210 -4.4827
dipole: 5.9893
quadrupole: -117.3188 -111.1510 -135.8441
quadrupole: -18.1106 11.8239 1.0381
quadrupole: 4.1192 10.2870 -14.4061 -18.1106 11.8239 1.0381
hfenergy: -1503.5869271 hartree
pointgroup: C01 [X(C19H23N4O2S1)]
dipole: -0.2758324 -1.2884497 -1.9535539 debye
polarizability: 258.9972013|-17.1749997|276.7325433|-4.7269011|16.5653573|228.4227539 unknown
InChI: InChI=1S/C19H23N4O2S/c1-12-16(8-9-24)26-19(17(25)14-6-4-3-5-7-14)23(12)11-15-10-21-13(2)22-18(15)20/h3-7,10,17,24-25H,8-9,11,20H2,1-2H3
charge 1 multiplicity 1
49 atoms
S  2.167271 -2.20969 -1.068443
O  3.410366 0.025423 -2.118336
O  2.900801 -4.528361 0.355183
N  -0.035116 -0.825727 -1.262731
N  -3.918345 1.062652 0.906702
N  -1.842385 1.126526 2.165725
N  -4.006827 0.739223 -1.390857
C  1.306619 -0.701939 -1.410454
C  -0.484648 -2.129927 -0.888761
C  0.568654 -3.012057 -0.723676
C  -1.002051 0.311344 -1.482922
C  2.078616 0.546325 -1.781956
C  0.524633 -4.468697 -0.352148
C  -1.950045 -2.430421 -0.7292
C  -1.801177 0.662142 -0.242224
C  2.11389 1.591158 -0.663979
C  1.525941 -4.840881 0.77107
C  -3.224552 0.827122 -0.255618
C  1.66742 2.910524 -0.920801
C  2.633114 1.256807 0.614427
C  -1.174089 0.860738 1.009791
C  1.723994 3.888822 0.09761
C  2.692338 2.237248 1.62738
C  2.23187 3.551864 1.373013
C  -3.217457 1.19101 2.067902
C  -3.986687 1.44383 3.335012
H  -1.659797 0.000571 -2.314326
H  -0.409654 1.172536 -1.8307
H  1.621174 1.002804 -2.687574
H  0.740292 -5.09373 -1.241937
H  -0.495439 -4.728017 -0.015447
H  -2.117776 -3.517565 -0.756679
H  -2.342945 -2.047806 0.228949
H  -2.560201 -1.986608 -1.535125
H  1.412135 -5.909405 1.033273
H  1.345906 -4.231592 1.671559
H  1.293929 3.183581 -1.916767
H  3.001241 0.24295 0.811115
H  4.074504 0.759032 -2.078529
H  -0.082282 0.797888 1.100517
H  1.380528 4.908295 -0.104376
H  3.093714 1.980108 2.612882
H  2.27398 4.308567 2.162876
H  -5.010215 0.870758 -1.255131
H  -3.636288 0.811174 -2.334338
H  3.304091 -5.294891 -0.123439
H  -3.638358 0.771139 4.136989
H  -3.80402 2.476144 3.686791
H  -5.065067 1.310909 3.167108
