program: Gaussian 09
title: 000191562
version: EM64L-G09RevD.01
frameworkgroup: C1[X(C7H5N4O4)]
method: RPBEPBE
basis: SDD
operation: Freq
keyword: #p
keyword: freq=noraman
keyword: PBEPBE/SDD
title: #p freq=noraman PBEPBE/SDD
converged: YES YES NO NO
title: Mulliken charges:
elementType: O O O O N N N N C C C C C C C H H H H H
charge: -0.396502 -0.175818 -0.152803 -0.124242 0.030817 -0.291336 0.108799 0.161307 0.336090 0.225782 0.609455 -0.510433 -0.311937 -0.384570 0.143952 0.301922 0.306807 0.267274 0.432226 0.423208
chargesum: 1.00000
title: Mulliken charges with hydrogens summed into heavy atoms:
elementType: O O O O N N N N C C C C C C C
charge: 0.026706 -0.175818 -0.152803 -0.124242 0.030817 0.140890 0.108799 0.161307 0.336090 0.225782 0.609455 -0.208511 -0.005130 -0.117297 0.143952
polarizability: 3.02621669e+02 -6.38975525e+00 1.33211012e+02 4.22770995e+00 7.87295232e+00 5.48066999e+01
1716.lowfreq: -8.2502 -2.2521 -0.0007 -0.0006 -0.0004 1.6245 24.9203 29.9535 79.9506
frequency: 24.8817 29.9410 79.9504 87.1730 102.1830 145.0949 179.2876 192.7365 238.7279 300.4928 320.4057 352.0391 374.3523 375.4704 416.9756 467.2139 513.2822 554.2628 570.4985 602.2819 622.0905 654.9828 665.3355 709.1525 723.0996 756.5764 766.6949 838.7243 874.7468 902.0265 982.6807 1023.3966 1057.2480 1125.8239 1148.5231 1172.0523 1190.9998 1194.8586 1267.1131 1326.8697 1368.7574 1388.3351 1412.6623 1458.4307 1472.9705 1585.3446 1603.5517 1627.7055 2103.2974 3150.8110 3152.2949 3178.3763 3434.2923 3521.8077
redmass: 9.8852 8.9629 5.5247 12.1870 9.1110 5.6517 9.2056 7.4669 5.6602 9.3398 6.2529 11.4346 9.8972 7.1457 3.3286 6.1487 1.7170 2.4635 2.9274 2.1116 4.5679 7.6936 4.0078 7.2984 5.4622 7.2802 3.7624 1.5299 6.4386 1.6093 1.4044 5.2089 2.4683 5.5055 1.7470 1.5387 3.9556 8.8792 1.4283 2.6795 3.2912 11.5055 4.8373 1.4971 2.6671 6.9510 7.0860 10.8761 12.5229 1.0934 1.0921 1.0967 1.0791 1.0650
irintensity: 0.8675 6.2714 5.9642 2.3541 1.7245 1.5722 2.3112 5.2069 5.4174 9.5862 7.1794 5.5607 1.3753 14.7589 17.7937 22.2881 110.6941 9.9797 20.8189 78.4394 19.3342 2.3485 27.8161 47.7803 48.7740 16.0699 3.1811 40.7288 2.0411 40.5811 1.5159 199.0399 126.4901 5.4031 44.8255 6.4014 31.8047 76.1854 2.8651 51.0951 20.1736 67.8811 68.1933 45.5063 12.5280 10.3746 8.6177 178.4743 938.9412 8.7086 0.6782 5.3634 153.2900 179.4679
temp: 298.150 k
press: 1.00000 atm
elementType: 8 8 8 8 7 7 7 7 6 6 6 6 6 6 6 1 1 1 1 1
symmnumber: 1
zpe: 331299.1 jmol-1
zpe.correction: 0.126185 hartree
zpe.thermalcorrener: 0.139739 hartree
zpe.thermalcorrenthalpy: 0.140683 hartree
zpe.thermalcorrgfe: 0.083911 hartree
zpe.sumelectzpe: -788.125406 hartree
zpe.sumelectthermal: -788.111853 hartree
zpe.sumelectthermalent: -788.110908 hartree
zpe.sumelectthermalfe: -788.167680 hartree
dipole: 13.1183 0.0352 1.6847
dipole: 13.2261
quadrupole: -22.3937 -77.0282 -84.4674
quadrupole: 11.9763 -5.1564 -4.1333
quadrupole: 38.9027 -15.7318 -23.1710 11.9763 -5.1564 -4.1333
hfenergy: -788.2515916 hartree
pointgroup: C01 [X(C7H5N4O4)]
dipole: -5.1784286 -0.1954261 0.47191 debye
dipolederiv: -0.7813563 0.1278413 -0.4442082 0.3133598 -0.2977072 0.1403819 -0.7870249 -0.0495856 -0.7822397 -0.5005622 -0.1981181 0.0186128 0.1456654 -0.4988007 0.3226104 -0.3270515 0.0453466 -0.5437784 -0.1636399 0.0306763 0.0931571 0.1387081 -0.6529437 0.2279417 -0.0775966 0.1593881 -0.3180216 -0.2282284 -0.0914167 0.2122744 0.0614942 -0.3816592 0.0953962 0.0357437 0.1872784 -0.3099019 0.3341472 -0.16761 -0.3462008 -0.3410704 1.082138 -0.3747417 0.1407686 -0.3651701 0.5205455 -0.1609868 0.2441853 -0.0384523 0.4239441 -0.122246 0.0254331 0.0219637 0.0743759 -0.1591089 2.2161033 -0.1643083 0.193017 -1.9416551 0.1450628 -0.0946667 0.3851938 -0.0669984 0.2228354 -1.8241537 -0.178866 -0.0758209 1.5694906 0.1870302 0.0592065 -0.4229228 -0.0148232 0.1270637 -0.041023 0.0673833 0.0458472 -0.0721847 -0.178785 0.0640791 -0.1191273 0.0277213 0.0673581 0.0025294 0.0428315 -0.0342969 0.0710528 0.0588001 0.0175582 -0.0558255 -0.014373 0.0129361 0.1904966 0.067224 -0.0459279 -0.0253974 0.0928925 0.0328591 0.1679892 0.0483271 0.0896962 0.1802495 0.0600541 0.0153932 -0.1122175 -0.0280736 -0.0258188 -0.1234242 -0.0215423 -0.0843904 -0.2492488 -0.011831 -0.0095861 0.0687201 0.1414458 -0.0033708 -0.0133245 -0.0600554 -0.0452814 0.0839552 -0.0536365 0.0071642 0.1510964 -0.0266965 0.006532 -0.0323154 -0.0064537 -0.1188985 1.0928995 0.2153957 0.3990187 -0.38209 0.539299 -0.5600349 0.9975258 -0.0613582 1.014931 0.0339575 -0.0251692 -0.0032494 -0.0499499 0.0912701 0.0027162 0.0336709 -0.0002217 0.1832916 0.0946226 -0.0266398 0.0003334 0.0191444 0.0886102 0.0009098 0.0003676 0.0100262 0.1553148 -0.0168881 0.0411717 -0.0076479 -0.0311929 0.1031246 0.0036087 0.0031839 0.0124665 0.1806814 0.2994681 0.0572055 -0.0322927 0.0663866 0.3853993 -0.0098701 -0.026609 -0.011602 0.4058316 0.4376584 -0.0363731 0.052865 -0.0733045 0.2718392 0.0692701 0.1988144 0.1072536 0.3811355 unknown
polarizability: 302.7677583|1.6682379|131.1274591|6.0094151|-14.3139091|56.7441636 unknown
InChI: InChI=1S/C7H5N4O4/c8-10-9-4-1-2-5(7(12)13)6(3-4)11(14)15/h1-3,9,12H
charge 1 multiplicity 1
20 atoms
O  3.078755 0.933542 1.023389
O  2.570747 2.457972 -0.67475
O  1.641768 -2.692597 0.620808
O  2.85247 -1.251321 -0.683208
N  1.824949 -1.575841 0.010368
N  -3.003613 -0.852872 0.094873
N  -4.09512 -0.207126 -0.185343
N  -5.051291 0.430757 -0.40798
C  0.700697 -0.585784 0.062982
C  0.926804 0.810122 -0.0008
C  -1.680521 -0.243661 0.041778
C  -0.592573 -1.135642 0.099246
C  -0.202477 1.664603 -0.085067
C  -1.513397 1.154713 -0.064662
C  2.281487 1.47776 0.039029
H  -0.703577 -2.223887 0.167678
H  -0.035162 2.743199 -0.160692
H  -2.360632 1.847105 -0.115948
H  -3.118199 -1.854073 0.320483
H  3.980988 1.354631 1.047316
