program: Gaussian 09
title: 000191636
version: EM64L-G09RevD.01
frameworkgroup: C1[X(C19H33NO4)]
method: RPBEPBE
basis: SDD
operation: Freq
keyword: #p
keyword: freq=noraman
keyword: PBEPBE/SDD
title: #p freq=noraman PBEPBE/SDD
converged: YES YES NO NO
title: Mulliken charges:
elementType: O O O O N C C C C C C C C C C C C C C C C C C C H H H H H H H H H H H H H H H H H H H H H H H H H H H H H H H H H
charge: -0.266266 -0.234713 -0.439811 -0.237385 -0.186934 0.005744 -0.486340 -0.438274 -0.529254 -0.421266 0.168845 -0.399697 -0.540055 -0.359179 0.244212 -0.403406 -0.527058 -0.392901 -0.384923 -0.346092 -0.477131 -0.359015 0.194972 -0.693194 0.244181 0.225415 0.222551 0.240354 0.219874 0.240084 0.249006 0.245405 0.216047 0.201607 0.253132 0.246423 0.244409 0.207141 0.199839 0.193307 0.200490 0.235795 0.235765 0.242792 0.222984 0.208108 0.253187 0.195000 0.152547 0.246518 0.245595 0.195642 0.219253 0.207820 0.221622 0.204325 0.372902
chargesum: 0.00000
title: Mulliken charges with hydrogens summed into heavy atoms:
elementType: O O O O N C C C C C C C C C C C C C C C C C C C
charge: -0.266266 -0.234713 -0.066909 -0.237385 -0.186934 0.249925 -0.038374 0.021954 -0.040164 0.040186 0.168845 0.055041 -0.049223 0.047801 0.244212 -0.009609 -0.055498 0.072875 0.076372 0.001455 0.014982 0.055880 0.194972 -0.059427
polarizability: 2.62998483e+02 5.68706649e+00 2.09068917e+02 2.91594961e+00 -1.12135572e+01 1.86197407e+02
1716.lowfreq: -13.6127 -10.0592 -0.0009 -0.0008 -0.0007 2.5284 12.9559 17.4194 23.7380
frequency: 12.3271 16.9636 23.5646 33.2627 40.2714 52.5049 56.4946 64.1657 66.9099 68.3958 75.8376 80.6637 96.8656 126.2815 138.6294 145.2952 146.4575 159.7930 180.2338 188.7626 206.6665 218.2280 227.5343 230.6408 251.5741 289.4752 324.9392 337.9242 357.9014 396.2623 410.3780 419.4518 426.0393 457.5326 475.1072 493.0670 511.5587 527.4141 566.7366 587.8220 590.9814 633.4509 642.7446 644.9506 703.2782 716.8310 723.2009 743.5681 782.0485 786.7931 797.9070 814.2458 834.9459 838.4425 864.5604 883.0729 894.8447 902.8989 914.3943 933.0697 951.3502 952.0012 978.4178 989.7475 1007.0232 1018.6260 1022.6805 1040.2368 1047.6726 1055.9203 1058.5183 1070.7421 1076.2641 1089.6833 1097.2363 1102.3294 1115.5802 1118.0317 1122.4857 1145.1962 1151.7324 1156.6281 1179.8986 1200.6262 1204.9216 1206.4054 1223.7747 1237.3649 1239.5164 1246.6881 1255.6095 1262.1877 1273.1454 1278.2713 1282.3208 1283.2404 1292.3784 1298.4854 1303.6197 1305.0672 1308.9466 1325.5857 1328.3975 1338.4360 1348.9692 1352.5610 1353.6789 1358.7797 1362.9178 1364.4121 1371.8820 1390.3139 1393.6598 1426.9281 1430.5295 1436.9982 1453.6545 1456.7589 1465.5110 1467.3127 1471.4310 1473.3067 1473.8915 1474.4752 1477.7191 1482.7447 1483.8971 1484.8114 1492.2779 1620.5427 1635.1975 1667.2543 2929.0330 2940.2537 2944.6174 2961.0505 2966.9300 2969.8350 2971.1079 2972.6687 2974.3995 2976.4032 2983.8875 2985.8733 2992.0720 2999.6478 3003.5746 3004.0995 3009.4508 3009.9043 3011.2734 3017.8193 3022.4939 3025.3396 3039.8122 3052.3705 3054.9406 3060.8624 3062.8164 3067.3114 3073.5568 3074.2263 3074.3280 3090.4550 3493.2811
redmass: 5.2610 4.4891 4.8370 5.0960 5.4801 6.9469 4.1384 1.9734 2.9827 4.5343 2.7782 3.4289 4.0364 2.3580 2.4039 2.7573 1.9734 3.1234 3.0020 2.8287 3.0125 2.8357 1.1488 2.7446 4.0282 2.5643 2.4359 2.9243 3.3393 3.1313 3.2011 2.5533 2.8997 2.3101 2.9192 3.1597 2.0243 2.9852 3.0846 2.8521 3.2478 3.0891 2.7126 1.8152 1.9108 1.2812 1.1858 1.3737 1.8614 1.6904 1.6272 1.9244 1.7119 1.7695 3.1970 1.9897 1.8960 2.0376 2.2020 2.3123 1.5097 1.7640 3.3394 2.0694 1.8946 2.1266 2.1247 2.1488 2.4877 1.8751 1.7955 2.1643 2.3243 2.5103 1.7564 2.1580 2.1934 2.2744 2.2865 1.6931 1.8763 1.3122 1.4781 1.5264 1.4037 1.5451 1.4468 1.4579 1.3594 1.7493 1.2619 1.3199 1.3498 1.3386 1.0624 1.3203 1.1566 1.2367 1.3931 1.4052 1.3738 1.4020 1.3828 1.4115 1.4005 1.5368 1.4956 1.7193 1.4840 1.5827 1.4605 1.2175 2.3320 1.0887 1.0943 1.0943 1.0855 1.0870 1.0846 1.0726 1.0749 1.0598 1.0959 1.0832 1.0429 1.0710 1.0817 1.0924 1.0944 7.7329 10.2868 8.0884 1.0635 1.0823 1.0640 1.0602 1.0624 1.0624 1.0362 1.0606 1.0641 1.0641 1.0889 1.0630 1.0685 1.0632 1.0685 1.0610 1.0680 1.0905 1.0950 1.0944 1.0948 1.1019 1.1024 1.0947 1.0987 1.1000 1.1014 1.1007 1.0991 1.0994 1.0992 1.1000 1.0637
irintensity: 0.3988 0.7714 0.1736 0.0884 1.2935 0.1986 7.1491 0.9702 0.3816 2.2857 0.0969 1.5572 2.6677 1.4506 1.8534 1.9724 1.1176 1.5072 1.5317 1.4676 0.2848 1.5502 0.1254 0.8544 5.0489 2.9846 3.8644 5.2527 6.1984 3.4905 11.6524 3.9736 1.2061 5.4641 2.6690 4.9819 39.1145 1.9945 4.9493 8.9791 33.0921 14.9665 51.3093 105.6175 2.4898 20.9578 3.1666 2.9545 8.1729 11.0881 1.8743 5.0087 7.9379 3.2253 3.1856 1.0753 3.7834 6.3824 9.7530 8.6232 12.0397 10.1913 14.9075 3.8033 25.2212 7.3443 1.6422 85.2417 44.2069 27.2732 13.1233 0.7988 1.3063 3.1330 6.4791 10.5655 1.8674 12.3365 26.9715 29.1764 19.1166 5.9114 7.7947 3.4102 3.8692 31.6676 4.8228 11.6220 20.9675 30.4766 1.4117 25.7110 27.4776 13.2628 2.4593 29.3484 2.6489 0.3028 10.5501 7.3411 18.7267 29.7348 11.6981 9.5151 1.9321 5.9398 14.1061 23.9024 22.1507 19.2233 1.2654 10.9714 80.5516 22.1069 29.1478 18.8630 10.8054 11.9719 8.9612 0.6984 0.5439 1.0128 7.0985 24.1672 12.4590 3.1717 14.9863 13.0750 24.6226 91.1055 365.2166 177.2528 35.2662 43.2978 17.6724 43.5541 22.9362 10.7093 46.6683 15.7219 9.4506 16.2685 32.3159 64.6001 31.8130 21.5794 9.8097 40.3388 12.4017 14.0174 23.1529 18.0528 34.8863 15.9173 52.1083 9.8251 30.5262 5.3301 20.5850 116.9831 41.4761 16.9971 51.7592 29.8761 14.0370
temp: 298.150 k
press: 1.00000 atm
elementType: 8 8 8 8 7 6 6 6 6 6 6 6 6 6 6 6 6 6 6 6 6 6 6 6 1 1 1 1 1 1 1 1 1 1 1 1 1 1 1 1 1 1 1 1 1 1 1 1 1 1 1 1 1 1 1 1 1
symmnumber: 1
zpe: 1297154.3 jmol-1
zpe.correction: 0.494060 hartree
zpe.thermalcorrener: 0.521862 hartree
zpe.thermalcorrenthalpy: 0.522806 hartree
zpe.thermalcorrgfe: 0.431234 hartree
zpe.sumelectzpe: -1097.584701 hartree
zpe.sumelectthermal: -1097.556898 hartree
zpe.sumelectthermalent: -1097.555954 hartree
zpe.sumelectthermalfe: -1097.647527 hartree
dipole: -3.9556 -4.3379 0.3336
dipole: 5.8801
quadrupole: -181.7163 -138.3220 -144.2278
quadrupole: 5.8692 -8.8014 1.5535
quadrupole: -26.9609 16.4334 10.5275 5.8692 -8.8014 1.5535
hfenergy: -1098.0787606 hartree
pointgroup: C01 [X(C19H33N1O4)]
dipole: -1.578832 1.6605198 -0.3191727 debye
polarizability: 263.1548179|-5.1841952|206.1939997|-2.0249|-13.4729403|188.9159896 unknown
InChI: InChI=1S/C19H33NO4/c1-2-3-6-9-17(21)13-11-16-12-14-18(22)20(16)15-8-5-4-7-10-19(23)24/h16,23H,2-15H2,1H3
charge 0 multiplicity 1
57 atoms
O  5.402239 -0.026078 -0.874018
O  -0.722485 0.566707 1.251469
O  -2.124444 -1.209313 -1.796698
O  -2.82443 -2.650016 -0.120929
N  3.355369 0.6569 0.092004
C  2.079166 1.303875 -0.304174
C  2.452243 2.011048 -1.644719
C  1.522736 2.26057 0.774999
C  3.67135 1.225851 -2.185621
C  3.546866 -0.03525 1.37841
C  4.278929 0.551178 -0.945969
C  2.491033 -1.135513 1.653957
C  0.088997 2.728081 0.450967
C  2.515912 -2.285718 0.621346
C  -0.973818 1.633706 0.626081
C  1.456718 -3.386599 0.887382
C  -2.338231 1.89087 -0.011711
C  -0.021524 -2.932684 0.787701
C  -3.488653 1.058436 0.59101
C  -4.764054 1.068774 -0.28023
C  -0.401538 -2.433852 -0.623297
C  -5.88205 0.162275 0.284627
C  -1.880999 -2.148756 -0.770451
C  -7.153812 0.157434 -0.590434
H  1.31626 0.51666 -0.48857
H  1.605668 2.026422 -2.351208
H  2.740239 3.057719 -1.433502
H  1.498184 1.744358 1.75168
H  2.197831 3.131952 0.871692
H  3.379133 0.433532 -2.900768
H  4.424812 1.85587 -2.685283
H  4.561812 -0.472039 1.331584
H  3.536968 0.703408 2.204151
H  2.694781 -1.547379 2.663604
H  1.483235 -0.680397 1.700282
H  0.009293 3.146773 -0.572491
H  -0.201807 3.559462 1.128006
H  3.523244 -2.748011 0.623736
H  2.382786 -1.871546 -0.398776
H  1.62422 -4.222547 0.176525
H  1.624938 -3.804122 1.901142
H  -2.558769 2.976809 0.00887
H  -2.218219 1.630152 -1.087758
H  -0.233826 -2.129793 1.516898
H  -0.682515 -3.778822 1.053321
H  -3.729288 1.441123 1.602734
H  -3.141208 0.01933 0.735246
H  -5.146422 2.105631 -0.386766
H  -4.51177 0.734198 -1.312081
H  0.151683 -1.520602 -0.90102
H  -0.136904 -3.201355 -1.38125
H  -6.138049 0.500324 1.309143
H  -5.491559 -0.870236 0.386741
H  -7.57734 1.175418 -0.684893
H  -7.935513 -0.495211 -0.160898
H  -6.933824 -0.209899 -1.61113
H  -3.109592 -1.080408 -1.880067
