program: Gaussian 09
title: 000191594
version: EM64L-G09RevD.01
frameworkgroup: C1[X(C10H13NO5)]
method: RPBEPBE
basis: SDD
operation: Freq
keyword: #p
keyword: freq=noraman
keyword: PBEPBE/SDD
title: #p freq=noraman PBEPBE/SDD
converged: YES YES NO NO
title: Mulliken charges:
elementType: O O O O O N C C C C C C C C C C H H H H H H H H H H H H H
charge: -0.477000 -0.489511 -0.422011 -0.226557 -0.429973 -0.587884 -0.101199 -0.296751 -0.188275 0.424488 -0.364423 -0.404133 0.161381 -0.338330 -0.383507 0.280031 0.263292 0.261589 0.270405 0.265758 0.259849 0.299689 0.283557 0.372039 0.356344 0.252435 0.221430 0.382124 0.355144
chargesum: 0.00000
title: Mulliken charges with hydrogens summed into heavy atoms:
elementType: O O O O O N C C C C C C C C C C
charge: -0.104961 -0.133167 -0.039887 -0.226557 -0.074830 -0.004638 0.162094 -0.035162 0.082129 0.424488 -0.098664 -0.144283 0.161381 -0.085895 -0.162077 0.280031
polarizability: 1.60738812e+02 1.91274447e+01 1.10220383e+02 6.75696314e+00 -8.54107270e+00 1.21784456e+02
1716.lowfreq: -14.7545 -9.0411 -0.0005 0.0003 0.0005 4.0668 29.7874 37.2860 38.8619
frequency: 29.4476 37.2497 38.8381 61.3202 90.0399 129.1478 150.5681 180.6384 238.4351 257.3728 282.8558 290.4083 308.4176 319.4921 335.0126 366.8406 385.0922 408.5112 418.2822 452.5581 464.4168 522.4165 531.1586 542.4276 557.5872 599.7301 627.7616 633.5121 723.6200 730.9652 778.9025 788.5736 809.6724 832.9670 837.8034 867.3880 908.3848 938.7488 965.3975 967.5289 995.5344 1004.1548 1011.7387 1039.8252 1100.7392 1141.6371 1145.2302 1151.4411 1177.1856 1193.2978 1217.1192 1247.1960 1249.1795 1268.9583 1283.9378 1295.2765 1306.7480 1336.3159 1345.9072 1356.2504 1378.8508 1398.3529 1428.8511 1502.6530 1594.8945 1625.0541 1639.4165 1663.8791 2998.8321 3005.5083 3019.7343 3113.0372 3140.3082 3143.1734 3171.8127 3434.8227 3511.5665 3512.8769 3554.0997 3581.8175 3588.4659
redmass: 4.1815 8.3063 5.1416 7.0351 6.5377 5.6984 5.9606 5.4373 3.2031 4.7698 2.2660 2.1584 2.1865 4.5489 1.4120 1.1141 4.1407 3.2328 4.1804 4.6195 2.7410 1.3337 3.0421 2.5643 5.0556 3.4446 1.7038 5.8253 3.9288 3.6560 4.2612 2.0360 1.3850 4.5281 1.5252 3.7133 3.0779 1.4111 5.5085 1.3528 2.8184 2.7593 2.6094 2.3604 1.4121 1.4680 1.3670 1.5509 1.1128 1.5718 1.7046 1.3848 2.8721 1.4771 1.4998 1.6551 1.3565 1.3137 1.3752 1.3659 1.7491 5.2311 2.6535 2.7677 6.4727 6.3432 1.1083 8.0123 1.0820 1.0839 1.0867 1.0883 1.0954 1.0895 1.0961 1.0461 1.0642 1.0647 1.0949 1.0660 1.0664
irintensity: 2.7691 1.4896 0.4851 0.8655 1.0829 2.0665 0.4169 0.6382 21.3588 1.7945 40.4722 18.4193 55.0248 26.1836 77.3515 141.3785 22.9621 3.4486 9.1520 18.4899 6.3959 140.9480 12.6042 59.7694 21.3338 6.7552 158.0575 10.3733 14.0503 28.9511 25.8945 142.4754 43.1499 21.0437 54.4236 59.4720 4.4248 2.5841 95.5964 0.4707 70.6704 4.5025 58.0310 157.1419 31.2124 301.8471 25.2864 24.1702 8.2045 6.3036 2.6785 6.1167 38.2913 31.6830 38.5860 19.8830 27.7640 9.0274 6.1872 4.5165 56.1432 8.8744 12.3771 76.4936 18.4031 48.7766 34.7454 276.0803 4.3240 4.3326 38.6995 16.7547 9.9503 2.1570 5.3720 5.1700 14.1564 39.7981 9.0851 43.2033 10.4576
temp: 298.150 k
press: 1.00000 atm
elementType: 8 8 8 8 8 7 6 6 6 6 6 6 6 6 6 6 1 1 1 1 1 1 1 1 1 1 1 1 1
symmnumber: 1
zpe: 587875.9 jmol-1
zpe.correction: 0.223910 hartree
zpe.thermalcorrener: 0.240118 hartree
zpe.thermalcorrenthalpy: 0.241062 hartree
zpe.thermalcorrgfe: 0.179136 hartree
zpe.sumelectzpe: -818.510962 hartree
zpe.sumelectthermal: -818.494754 hartree
zpe.sumelectthermalent: -818.493810 hartree
zpe.sumelectthermalfe: -818.555735 hartree
dipole: -3.0964 -0.1132 1.2605
dipole: 3.3451
quadrupole: -102.6374 -85.4247 -86.1814
quadrupole: 3.2539 -11.1823 -0.5053
quadrupole: -11.2229 5.9898 5.2331 3.2539 -11.1823 -0.5053
hfenergy: -818.7348719 hartree
pointgroup: C01 [X(C10H13N1O5)]
dipole: 1.2852925 0.2813894 -0.0289783 debye
polarizability: 161.4946471|-18.1149984|112.0233035|-2.1848739|-11.7371327|119.2257003 unknown
InChI: InChI=1S/C10H13NO5/c11-7(10(15)16)9(14)8(13)5-1-3-6(12)4-2-5/h1-4,7-9,12-15H,11H2
charge 0 multiplicity 1
29 atoms
O  -2.892921 0.966057 0.676662
O  -0.774694 1.420242 2.23753
O  -2.666408 -2.097357 -0.874522
O  -3.621537 -0.710361 -2.474353
O  4.650533 -1.420871 0.150254
N  -1.748912 1.390926 -1.865871
C  -1.630665 0.296552 0.341247
C  -0.443911 1.175941 0.807514
C  -1.643619 0.093641 -1.189606
C  0.907947 0.509719 0.634011
C  1.337085 -0.517882 1.51628
C  1.758177 0.89354 -0.43133
C  -2.760671 -0.895682 -1.589936
C  2.583795 -1.147346 1.3412
C  3.008627 0.267109 -0.6225
C  3.418936 -0.754196 0.268533
H  -1.570294 -0.688645 0.843656
H  -0.479204 2.126277 0.240232
H  -0.687781 -0.396431 -1.462156
H  0.690362 -0.810833 2.350492
H  1.431014 1.679455 -1.122452
H  -2.543993 1.923375 -1.488022
H  -1.822984 1.302865 -2.885558
H  -2.783616 1.312738 1.602332
H  -0.091729 2.01702 2.632007
H  2.927256 -1.937639 2.015253
H  3.658019 0.574078 -1.45283
H  -3.391094 -2.714486 -1.166031
H  5.16128 -1.08511 -0.627735
