program: Gaussian 09
title: 000191549
version: EM64L-G09RevD.01
frameworkgroup: C1[X(C16H18OS)]
method: RPBEPBE
basis: SDD
operation: Freq
keyword: #p
keyword: freq=noraman
keyword: PBEPBE/SDD
title: #p freq=noraman PBEPBE/SDD
converged: YES YES NO NO
title: Mulliken charges:
elementType: S O C C C C C C C C C C C C C C C C H H H H H H H H H H H H H H H H H H
charge: 0.262954 -0.437221 0.183530 0.329206 -0.167081 -0.519436 0.126338 -0.560221 -0.498925 0.159447 -0.761729 -0.457211 -0.549272 0.450273 -0.496529 -0.464913 -0.252829 -0.560741 0.207390 0.201580 0.216235 0.229492 0.227677 0.224210 0.235481 0.238738 0.228395 0.209490 0.235057 0.237574 0.220730 0.230092 0.227185 0.332953 0.249212 0.262871
chargesum: 0.00000
title: Mulliken charges with hydrogens summed into heavy atoms:
elementType: S O C C C C C C C C C C C C C C C C
charge: 0.262954 -0.104268 0.183530 0.329206 0.040309 -0.101622 0.126338 -0.103052 -0.039235 0.159447 -0.085106 -0.222154 -0.090968 0.450273 -0.039252 -0.464913 -0.003617 -0.297870
polarizability: 2.86251500e+02 2.71035403e+01 1.93568353e+02 -2.01362968e-01 -9.24224335e-01 1.11101510e+02
1716.lowfreq: -13.1086 -6.3405 0.0005 0.0017 0.0018 5.6641 43.2378 68.8301 102.6271
frequency: 43.1684 68.8182 102.6213 122.2723 157.6239 180.9396 197.0445 216.8344 238.8207 247.0711 259.2182 270.1990 285.6218 306.4018 343.4475 365.8935 379.7683 410.5122 436.8408 461.5730 472.5582 528.6356 543.9858 568.0594 576.7563 639.1458 643.8842 658.0002 675.0176 693.3355 715.6233 729.2398 757.2549 803.8011 815.1975 858.3910 866.9109 880.1546 884.3951 920.1515 935.1747 973.7557 985.2771 990.7416 1009.0381 1017.3710 1023.4215 1027.6741 1045.6675 1083.8692 1091.5780 1125.3316 1133.5691 1157.4192 1170.0817 1183.1270 1193.1218 1210.0505 1219.7520 1222.7321 1231.5240 1257.1154 1259.5187 1275.8052 1311.7775 1316.1959 1328.1171 1334.7075 1342.5932 1370.1344 1378.6874 1388.4628 1392.7765 1447.2435 1452.8291 1455.1321 1461.0804 1465.0657 1468.7746 1480.5063 1481.8561 1543.8540 1595.1720 1621.0587 2932.5175 2948.1851 2950.5490 2960.1945 2961.7847 2973.2961 2984.3177 3005.1536 3023.7267 3040.6288 3043.8434 3045.7825 3075.7137 3090.8428 3150.7602 3173.3885 3238.4503 3560.2945
redmass: 5.8261 3.5371 3.4789 5.2399 2.1798 2.3428 1.7638 2.7239 2.3459 3.2274 2.4182 2.7583 2.9525 1.2173 2.4866 3.1516 4.5598 3.9569 3.6184 3.9401 4.0995 4.1560 4.6967 5.0811 3.5556 2.3909 3.7175 2.2686 3.6527 2.9553 3.1611 2.0021 3.6914 1.5020 3.1408 2.2820 2.4512 2.0570 1.4850 2.3420 1.8444 2.2677 1.8803 1.9814 2.5023 1.8846 2.7320 1.8672 3.6302 1.2030 1.6446 1.5293 1.9872 2.1683 1.6185 1.6170 2.0247 1.3663 1.5100 1.4050 1.3444 1.8441 1.8472 1.4677 1.4909 1.5944 1.4292 1.9263 1.6018 1.5561 2.4324 2.3527 1.9184 1.1253 1.0867 1.1156 1.0841 1.1078 1.0729 4.3362 1.1209 6.4375 7.2239 7.8728 1.0848 1.0694 1.0640 1.0651 1.0613 1.0646 1.0363 1.0936 1.1018 1.0911 1.0963 1.0943 1.0983 1.0996 1.0948 1.0917 1.0995 1.0660
irintensity: 0.1257 0.2642 0.4260 1.1734 0.4916 2.6544 4.1950 4.2333 2.0384 3.3472 2.5834 11.3601 0.3733 148.1687 3.2831 3.7081 7.4702 0.4848 0.7737 12.9316 12.0813 0.2994 0.3231 0.8728 1.9666 3.1819 9.7120 28.2331 0.9111 15.3728 0.3579 31.6928 3.2786 27.4613 13.3963 14.5276 6.7453 3.6118 2.4776 3.4117 2.4535 5.1511 18.5691 10.1244 76.2213 13.4827 47.1415 4.2317 7.8685 10.3041 4.1550 4.2095 5.8633 0.5729 5.6206 3.3650 11.7323 5.5352 5.2609 28.3020 8.4201 5.8497 2.6895 5.4337 5.5337 11.3150 2.6507 16.1503 0.9072 2.2826 9.4811 5.4628 13.1700 8.2745 1.4693 10.8345 2.5017 10.6640 16.4386 13.9794 3.8633 13.1738 0.4069 6.2016 43.1468 32.5379 27.4165 32.5289 52.0357 40.0515 27.8921 28.9844 48.2687 26.4607 44.0906 18.4267 33.6930 17.1688 20.4126 4.6339 0.6020 3.3269
temp: 298.150 k
press: 1.00000 atm
elementType: 16 8 6 6 6 6 6 6 6 6 6 6 6 6 6 6 6 6 1 1 1 1 1 1 1 1 1 1 1 1 1 1 1 1 1 1
symmnumber: 1
zpe: 777233.9 jmol-1
zpe.correction: 0.296033 hartree
zpe.thermalcorrener: 0.312025 hartree
zpe.thermalcorrenthalpy: 0.312969 hartree
zpe.thermalcorrgfe: 0.253698 hartree
zpe.sumelectzpe: -1092.444330 hartree
zpe.sumelectthermal: -1092.428338 hartree
zpe.sumelectthermalent: -1092.427394 hartree
zpe.sumelectthermalfe: -1092.486665 hartree
dipole: -0.6121 -0.8909 -0.8435
dipole: 1.3711
quadrupole: -126.1396 -100.6663 -116.8911
quadrupole: -1.6155 -4.1162 0.8354
quadrupole: -11.5739 13.8994 -2.3255 -1.6155 -4.1162 0.8354
hfenergy: -1092.7403632 hartree
pointgroup: C01 [X(C16H18O1S1)]
dipole: 0.2533156 0.345414 -0.3278702 debye
polarizability: 287.9750217|23.9002703|191.8157289|0.884407|1.7687686|111.130612 unknown
InChI: InChI=1S/C16H18OS/c1-16-8-6-10-11(13(16)3-5-15(16)17)2-4-14-12(10)7-9-18-14/h3,7,9,15,17H,2,4-6,8H2,1H3
charge 0 multiplicity 1
36 atoms
S  4.72358 -0.515491 0.032471
O  -4.692774 0.917389 -0.03744
C  -2.137561 0.591001 0.058495
C  -1.373739 -0.744062 0.01107
C  -3.533933 0.157406 -0.518265
C  -1.389864 1.63132 -0.80892
C  0.085905 -0.738402 0.031441
C  0.08177 1.787023 -0.354906
C  -3.694144 -1.324599 -0.09604
C  0.779719 0.454183 -0.106591
C  -2.270342 1.073658 1.528443
C  -2.251339 -1.798689 -0.030107
C  0.842551 -2.038654 0.311758
C  2.249217 0.444368 -0.006631
C  2.262791 -2.081573 -0.31441
C  2.946365 -0.763434 -0.068954
C  3.128136 1.591832 0.128217
C  4.469823 1.263916 0.169286
H  -3.476836 0.217966 -1.628978
H  -1.895165 2.618508 -0.771237
H  -1.405203 1.292525 -1.864513
H  0.13082 2.401667 0.569257
H  0.643666 2.356436 -1.121502
H  -4.315806 -1.900557 -0.804989
H  -4.201333 -1.374314 0.889852
H  -2.854415 0.353745 2.126765
H  -1.276874 1.181175 1.997933
H  -2.789046 2.048866 1.582169
H  -1.980663 -2.859209 -0.023146
H  0.926377 -2.157895 1.413059
H  0.263118 -2.906258 -0.05156
H  2.183511 -2.254482 -1.409414
H  2.833301 -2.931045 0.103019
H  -4.602768 1.861605 -0.322286
H  2.77254 2.622326 0.204536
H  5.336615 1.912047 0.282522
